BDBM50248475 3-(1-(2-(diethylamino)ethyl)-2-phenethyl-1H-benzo[d]imidazol-5-yl)-N-hydroxyacrylamide::CHEMBL491491::US10201527, Compound 66::US10736881, Compound 66::US8551988, 66
SMILES: CCN(CC)CCn1c(CCc2ccccc2)nc2cc(\C=C\C(=O)NO)ccc12
InChI Key: InChIKey=FFXUDLUXUIJFSS-NTCAYCPXSA-N
Data: 8 IC50
Activity Spreadsheet -- Enzyme Inhibition Constant Data from BindingDB
Found 8 hits for monomerid = 50248475
Trg + Lig
Ki
nM
ΔG°
kcal/mole
IC50
nM
Kd
nM
EC50/IC50
nM
koff
s-1
kon
M-1s-1
pHTemp
°C
Histone deacetylase 8
(Homo sapiens (Human))
BDBM50248475
(3-(1-(2-(diethylamino)ethyl)-2-phenethyl-1H-benzo[...)
Show SMILES CCN(CC)CCn1c(CCc2ccccc2)nc2cc(\C=C\C(=O)NO)ccc12
Show InChI InChI=1S/C24H30N4O2/c1-3-27(4-2)16-17-28-22-13-10-20(12-15-24(29)26-30)18-21(22)25-23(28)14-11-19-8-6-5-7-9-19/h5-10,12-13,15,18,30H,3-4,11,14,16-17H2,1-2H3,(H,26,29)/b15-12+
NCI pathway
Reactome pathway
US Patent
n/an/a 255n/an/an/an/an/an/a
Mei Pharma, Inc.
US Patent
Assay Description
The assay have been carried out in a 96 well format and the BIOMOL using a fluorescent-based HDAC activity assay.
US Patent US8551988 (2013)
BindingDB Entry DOI: 10.7270/Q2BZ64P8
Histone deacetylase 1
(Homo sapiens (Human))
BDBM50248475
(3-(1-(2-(diethylamino)ethyl)-2-phenethyl-1H-benzo[...)
Show SMILES CCN(CC)CCn1c(CCc2ccccc2)nc2cc(\C=C\C(=O)NO)ccc12
Show InChI InChI=1S/C24H30N4O2/c1-3-27(4-2)16-17-28-22-13-10-20(12-15-24(29)26-30)18-21(22)25-23(28)14-11-19-8-6-5-7-9-19/h5-10,12-13,15,18,30H,3-4,11,14,16-17H2,1-2H3,(H,26,29)/b15-12+
NCI pathway
Reactome pathway
US Patent
n/an/a 72n/an/an/an/an/an/a
Mei Pharma, Inc.
US Patent
Assay Description
The assay have been carried out in a 96 well format and the BIOMOL using a fluorescent-based HDAC activity assay.
US Patent US8551988 (2013)
BindingDB Entry DOI: 10.7270/Q2BZ64P8
Histone deacetylase 1
(Homo sapiens (Human))
BDBM50248475
(3-(1-(2-(diethylamino)ethyl)-2-phenethyl-1H-benzo[...)
Show SMILES CCN(CC)CCn1c(CCc2ccccc2)nc2cc(\C=C\C(=O)NO)ccc12
Show InChI InChI=1S/C24H30N4O2/c1-3-27(4-2)16-17-28-22-13-10-20(12-15-24(29)26-30)18-21(22)25-23(28)14-11-19-8-6-5-7-9-19/h5-10,12-13,15,18,30H,3-4,11,14,16-17H2,1-2H3,(H,26,29)/b15-12+
NCI pathway
Reactome pathway
n/an/a 52n/an/an/an/an/an/a
S *BIO Pte Ltd
Curated by ChEMBL
Assay Description
Inhibition of recombinant HDAC1 by fluorimetric assay
Bioorg Med Chem Lett 19: 1403-8 (2009)
Article DOI: 10.1016/j.bmcl.2009.01.041
BindingDB Entry DOI: 10.7270/Q2FT8KX3
Histone deacetylase 8
(Homo sapiens (Human))
BDBM50248475
(3-(1-(2-(diethylamino)ethyl)-2-phenethyl-1H-benzo[...)
Show SMILES CCN(CC)CCn1c(CCc2ccccc2)nc2cc(\C=C\C(=O)NO)ccc12
Show InChI InChI=1S/C24H30N4O2/c1-3-27(4-2)16-17-28-22-13-10-20(12-15-24(29)26-30)18-21(22)25-23(28)14-11-19-8-6-5-7-9-19/h5-10,12-13,15,18,30H,3-4,11,14,16-17H2,1-2H3,(H,26,29)/b15-12+
NCI pathway
Reactome pathway
US Patent
n/an/a 255n/an/an/an/an/an/a
MEI Pharma, Inc.
US Patent
US Patent US10736881 (2020)
Histone deacetylase 1
(Homo sapiens (Human))
BDBM50248475
(3-(1-(2-(diethylamino)ethyl)-2-phenethyl-1H-benzo[...)
Show SMILES CCN(CC)CCn1c(CCc2ccccc2)nc2cc(\C=C\C(=O)NO)ccc12
Show InChI InChI=1S/C24H30N4O2/c1-3-27(4-2)16-17-28-22-13-10-20(12-15-24(29)26-30)18-21(22)25-23(28)14-11-19-8-6-5-7-9-19/h5-10,12-13,15,18,30H,3-4,11,14,16-17H2,1-2H3,(H,26,29)/b15-12+
NCI pathway
Reactome pathway
US Patent
n/an/a 72n/an/an/an/an/an/a
MEI PHARMA, INC.
US Patent
Assay Description
The assay has been carried out in 96 well format and the BIOMOL fluorescent-based HDAC activity assay has been applied. The reaction composed of assa...
US Patent US10201527 (2019)
BindingDB Entry DOI: 10.7270/Q2PK0J7F
Histone deacetylase 8
(Homo sapiens (Human))
BDBM50248475
(3-(1-(2-(diethylamino)ethyl)-2-phenethyl-1H-benzo[...)
Show SMILES CCN(CC)CCn1c(CCc2ccccc2)nc2cc(\C=C\C(=O)NO)ccc12
Show InChI InChI=1S/C24H30N4O2/c1-3-27(4-2)16-17-28-22-13-10-20(12-15-24(29)26-30)18-21(22)25-23(28)14-11-19-8-6-5-7-9-19/h5-10,12-13,15,18,30H,3-4,11,14,16-17H2,1-2H3,(H,26,29)/b15-12+
NCI pathway
Reactome pathway
US Patent
n/an/a 255n/an/an/an/an/an/a
MEI PHARMA, INC.
US Patent
Assay Description
To determine EC50 where acetylated histone 3 was induced by 50%, Colo205 cells was cultivated in 96 well plate at 1.5×105 cells/well for 24 h. Colo20...
US Patent US10201527 (2019)
BindingDB Entry DOI: 10.7270/Q2PK0J7F
Histone deacetylase 1
(Homo sapiens (Human))
BDBM50248475
(3-(1-(2-(diethylamino)ethyl)-2-phenethyl-1H-benzo[...)
Show SMILES CCN(CC)CCn1c(CCc2ccccc2)nc2cc(\C=C\C(=O)NO)ccc12
Show InChI InChI=1S/C24H30N4O2/c1-3-27(4-2)16-17-28-22-13-10-20(12-15-24(29)26-30)18-21(22)25-23(28)14-11-19-8-6-5-7-9-19/h5-10,12-13,15,18,30H,3-4,11,14,16-17H2,1-2H3,(H,26,29)/b15-12+
NCI pathway
Reactome pathway
US Patent
n/an/a 72n/an/an/an/an/an/a
MEI Pharma, Inc.
US Patent
Assay Description
The assay has been carried out in 96 well format and the BIOMOL fluorescent-based HDAC activity assay has been applied. The reaction composed of assa...
US Patent US10736881 (2020)
Histone deacetylase 1
(Homo sapiens (Human))
BDBM50248475
(3-(1-(2-(diethylamino)ethyl)-2-phenethyl-1H-benzo[...)
Show SMILES CCN(CC)CCn1c(CCc2ccccc2)nc2cc(\C=C\C(=O)NO)ccc12
Show InChI InChI=1S/C24H30N4O2/c1-3-27(4-2)16-17-28-22-13-10-20(12-15-24(29)26-30)18-21(22)25-23(28)14-11-19-8-6-5-7-9-19/h5-10,12-13,15,18,30H,3-4,11,14,16-17H2,1-2H3,(H,26,29)/b15-12+
NCI pathway
Reactome pathway
n/an/a 52n/an/an/an/an/an/a
S*BIO Pte Ltd.
Curated by ChEMBL
Assay Description
Inhibition of full length recombinant HDAC1 using Fluor de Lys as substrate by fluorescence assay
J Med Chem 54: 4694-720 (2011)
Article DOI: 10.1021/jm2003552
BindingDB Entry DOI: 10.7270/Q29S1RD6