null
SMILES: Cc1ccncc1Oc1sc(C(N)=O)c2CCc3cnsc3-c12
InChI Key: InChIKey=ASBSOCYVAYZKGS-UHFFFAOYSA-N
Activity Spreadsheet -- Enzyme Inhibition Constant Data from BindingDB
Found 3 hits for monomerid = 50248658
Trg + Lig
Ki
nM
ΔG°
kcal/mole
IC50
nM
Kd
nM
EC50/IC50
nM
koff
s-1
kon
M-1s-1
pHTemp
°C
Cyclin-dependent kinase 8
(Homo sapiens (Human))
BDBM50248658
(CHEMBL4060714)
Show SMILES Cc1ccncc1Oc1sc(C(N)=O)c2CCc3cnsc3-c12
Show InChI InChI=1S/C16H13N3O2S2/c1-8-4-5-18-7-11(8)21-16-12-10(14(22-16)15(17)20)3-2-9-6-19-23-13(9)12/h4-7H,2-3H2,1H3,(H2,17,20)
Reactome pathway
n/an/an/an/a 16n/an/an/an/a
Takeda Pharmaceutical Co., Ltd.
Curated by ChEMBL
Assay Description
Inhibition of CDK8 in human SW620 cells assessed as decrease in STAT1 phosphorylation at Ser727 after 2 hrs by Western blot method
Bioorg Med Chem 25: 2336-2350 (2017)
Article DOI: 10.1016/j.bmc.2017.02.038
BindingDB Entry DOI: 10.7270/Q21J9D6H
Cyclin-C/Cyclin-dependent kinase 19
(Homo sapiens (Human))
BDBM50248658
(CHEMBL4060714)
Show SMILES Cc1ccncc1Oc1sc(C(N)=O)c2CCc3cnsc3-c12
Show InChI InChI=1S/C16H13N3O2S2/c1-8-4-5-18-7-11(8)21-16-12-10(14(22-16)15(17)20)3-2-9-6-19-23-13(9)12/h4-7H,2-3H2,1H3,(H2,17,20)
n/an/a 6.60n/an/an/an/an/an/a
Takeda Pharmaceutical Co., Ltd.
Curated by ChEMBL
Assay Description
Inhibition of kinase tracer-236 binding to GST-tagged CDK19/CyclinC (unknown origin) after 60 mins by TR-FRET assay
Bioorg Med Chem 25: 2336-2350 (2017)
Article DOI: 10.1016/j.bmc.2017.02.038
BindingDB Entry DOI: 10.7270/Q21J9D6H
Cyclin-C
(Homo sapiens (Human))
BDBM50248658
(CHEMBL4060714)
Show SMILES Cc1ccncc1Oc1sc(C(N)=O)c2CCc3cnsc3-c12
Show InChI InChI=1S/C16H13N3O2S2/c1-8-4-5-18-7-11(8)21-16-12-10(14(22-16)15(17)20)3-2-9-6-19-23-13(9)12/h4-7H,2-3H2,1H3,(H2,17,20)
n/an/a 4.70n/an/an/an/an/an/a
Takeda Pharmaceutical Co., Ltd.
Curated by ChEMBL
Assay Description
Inhibition of kinase tracer-236 binding to GST-tagged CDK8/CyclinC (unknown origin) after 60 mins by TR-FRET assay
Bioorg Med Chem 25: 2336-2350 (2017)
Article DOI: 10.1016/j.bmc.2017.02.038
BindingDB Entry DOI: 10.7270/Q21J9D6H