BDBM50248667 2,4-dichloro-N-((4-(4-methylpyridin-2-yl)-1-(propylsulfonyl)piperidin-4-yl)methyl)benzamide::CHEMBL465428
SMILES: CCCS(=O)(=O)N1CCC(CNC(=O)c2ccc(Cl)cc2Cl)(CC1)c1cc(C)ccn1
InChI Key: InChIKey=JQKOIGQQJGOHSS-UHFFFAOYSA-N
Data: 3 IC50
Activity Spreadsheet -- Enzyme Inhibition Constant Data from BindingDB
Found 3 hits for monomerid = 50248667
Trg + Lig
Ki
nM
ΔG°
kcal/mole
IC50
nM
Kd
nM
EC50/IC50
nM
koff
s-1
kon
M-1s-1
pHTemp
°C
Glycine transporter 2
(Homo sapiens (Human))
BDBM50248667
(2,4-dichloro-N-((4-(4-methylpyridin-2-yl)-1-(propy...)
Show SMILES CCCS(=O)(=O)N1CCC(CNC(=O)c2ccc(Cl)cc2Cl)(CC1)c1cc(C)ccn1
Show InChI InChI=1S/C22H27Cl2N3O3S/c1-3-12-31(29,30)27-10-7-22(8-11-27,20-13-16(2)6-9-25-20)15-26-21(28)18-5-4-17(23)14-19(18)24/h4-6,9,13-14H,3,7-8,10-12,15H2,1-2H3,(H,26,28)
Reactome pathway
n/an/a>3.00E+4n/an/an/an/an/an/a
Merck & Co.
Curated by ChEMBL
Assay Description
Inhibition of glycine transporter 2
Bioorg Med Chem Lett 19: 1488-91 (2009)
Article DOI: 10.1016/j.bmcl.2008.12.115
BindingDB Entry DOI: 10.7270/Q2V124P3
Sodium- and chloride-dependent taurine transporter
(Homo sapiens (Human))
BDBM50248667
(2,4-dichloro-N-((4-(4-methylpyridin-2-yl)-1-(propy...)
Show SMILES CCCS(=O)(=O)N1CCC(CNC(=O)c2ccc(Cl)cc2Cl)(CC1)c1cc(C)ccn1
Show InChI InChI=1S/C22H27Cl2N3O3S/c1-3-12-31(29,30)27-10-7-22(8-11-27,20-13-16(2)6-9-25-20)15-26-21(28)18-5-4-17(23)14-19(18)24/h4-6,9,13-14H,3,7-8,10-12,15H2,1-2H3,(H,26,28)
Reactome pathway
n/an/a>3.00E+4n/an/an/an/an/an/a
Merck & Co.
Curated by ChEMBL
Assay Description
Inhibition of taurine transporter
Bioorg Med Chem Lett 19: 1488-91 (2009)
Article DOI: 10.1016/j.bmcl.2008.12.115
BindingDB Entry DOI: 10.7270/Q2V124P3
Glycine transporter 1
(Homo sapiens (Human))
BDBM50248667
(2,4-dichloro-N-((4-(4-methylpyridin-2-yl)-1-(propy...)
Show SMILES CCCS(=O)(=O)N1CCC(CNC(=O)c2ccc(Cl)cc2Cl)(CC1)c1cc(C)ccn1
Show InChI InChI=1S/C22H27Cl2N3O3S/c1-3-12-31(29,30)27-10-7-22(8-11-27,20-13-16(2)6-9-25-20)15-26-21(28)18-5-4-17(23)14-19(18)24/h4-6,9,13-14H,3,7-8,10-12,15H2,1-2H3,(H,26,28)
n/an/a 3.5n/an/an/an/an/an/a
Merck & Co.
Curated by ChEMBL
Assay Description
Inhibition of human glycine transporter 1
Bioorg Med Chem Lett 19: 1488-91 (2009)
Article DOI: 10.1016/j.bmcl.2008.12.115
BindingDB Entry DOI: 10.7270/Q2V124P3