BDBM50248669 2-chloro-N-((4-(6-methylpyridin-2-yl)-1-(propylsulfonyl)piperidin-4-yl)methyl)benzamide::CHEMBL518070
SMILES: CCCS(=O)(=O)N1CCC(CNC(=O)c2ccccc2Cl)(CC1)c1cccc(C)n1
InChI Key: InChIKey=ZQZFNXIRAOQXHI-UHFFFAOYSA-N
Data: 3 IC50
Activity Spreadsheet -- Enzyme Inhibition Constant Data from BindingDB
Found 3 hits for monomerid = 50248669
Trg + Lig
Ki
nM
ΔG°
kcal/mole
IC50
nM
Kd
nM
EC50/IC50
nM
koff
s-1
kon
M-1s-1
pHTemp
°C
Glycine transporter 1
(Homo sapiens (Human))
BDBM50248669
(2-chloro-N-((4-(6-methylpyridin-2-yl)-1-(propylsul...)
Show SMILES CCCS(=O)(=O)N1CCC(CNC(=O)c2ccccc2Cl)(CC1)c1cccc(C)n1
Show InChI InChI=1S/C22H28ClN3O3S/c1-3-15-30(28,29)26-13-11-22(12-14-26,20-10-6-7-17(2)25-20)16-24-21(27)18-8-4-5-9-19(18)23/h4-10H,3,11-16H2,1-2H3,(H,24,27)
n/an/a 3n/an/an/an/an/an/a
Merck & Co.
Curated by ChEMBL
Assay Description
Inhibition of human glycine transporter 1
Bioorg Med Chem Lett 19: 1488-91 (2009)
Article DOI: 10.1016/j.bmcl.2008.12.115
BindingDB Entry DOI: 10.7270/Q2V124P3
Sodium- and chloride-dependent taurine transporter
(Homo sapiens (Human))
BDBM50248669
(2-chloro-N-((4-(6-methylpyridin-2-yl)-1-(propylsul...)
Show SMILES CCCS(=O)(=O)N1CCC(CNC(=O)c2ccccc2Cl)(CC1)c1cccc(C)n1
Show InChI InChI=1S/C22H28ClN3O3S/c1-3-15-30(28,29)26-13-11-22(12-14-26,20-10-6-7-17(2)25-20)16-24-21(27)18-8-4-5-9-19(18)23/h4-10H,3,11-16H2,1-2H3,(H,24,27)
Reactome pathway
n/an/a>3.00E+4n/an/an/an/an/an/a
Merck & Co.
Curated by ChEMBL
Assay Description
Inhibition of taurine transporter
Bioorg Med Chem Lett 19: 1488-91 (2009)
Article DOI: 10.1016/j.bmcl.2008.12.115
BindingDB Entry DOI: 10.7270/Q2V124P3
Glycine transporter 2
(Homo sapiens (Human))
BDBM50248669
(2-chloro-N-((4-(6-methylpyridin-2-yl)-1-(propylsul...)
Show SMILES CCCS(=O)(=O)N1CCC(CNC(=O)c2ccccc2Cl)(CC1)c1cccc(C)n1
Show InChI InChI=1S/C22H28ClN3O3S/c1-3-15-30(28,29)26-13-11-22(12-14-26,20-10-6-7-17(2)25-20)16-24-21(27)18-8-4-5-9-19(18)23/h4-10H,3,11-16H2,1-2H3,(H,24,27)
Reactome pathway
n/an/a>3.00E+4n/an/an/an/an/an/a
Merck & Co.
Curated by ChEMBL
Assay Description
Inhibition of glycine transporter 2
Bioorg Med Chem Lett 19: 1488-91 (2009)
Article DOI: 10.1016/j.bmcl.2008.12.115
BindingDB Entry DOI: 10.7270/Q2V124P3