BDBM50248694 3-({2-[(2S,4S)-2-Cyano-4-fluoropyrrolidin-1-yl]-2-oxoethyl}amino)-3-methyl-N-[(1S,2R)-2-(3-trifluoromethoxyphenyl)cyclopropyl]butanamide::CHEMBL463230
SMILES: CC(C)(CC(=O)N[C@H]1C[C@@H]1c1cccc(OC(F)(F)F)c1)NCC(=O)N1C[C@@H](F)C[C@H]1C#N
InChI Key: InChIKey=DBYNWOSOVYVBOA-ONIAQPFYSA-N
Data: 4 IC50
Activity Spreadsheet -- Enzyme Inhibition Constant Data from BindingDB
Found 4 hits for monomerid = 50248694
Trg + Lig
Ki
nM
ΔG°
kcal/mole
IC50
nM
Kd
nM
EC50/IC50
nM
koff
s-1
kon
M-1s-1
pHTemp
°C
Fibroblast activation protein alpha
(Homo sapiens (Human))
BDBM50248694
(3-({2-[(2S,4S)-2-Cyano-4-fluoropyrrolidin-1-yl]-2-...)
Show SMILES CC(C)(CC(=O)N[C@H]1C[C@@H]1c1cccc(OC(F)(F)F)c1)NCC(=O)N1C[C@@H](F)C[C@H]1C#N |r|
Show InChI InChI=1S/C22H26F4N4O3/c1-21(2,28-11-20(32)30-12-14(23)7-15(30)10-27)9-19(31)29-18-8-17(18)13-4-3-5-16(6-13)33-22(24,25)26/h3-6,14-15,17-18,28H,7-9,11-12H2,1-2H3,(H,29,31)/t14-,15-,17+,18-/m0/s1
n/an/a>2.00E+4n/an/an/an/an/an/a
National Health Research Institutes
Curated by ChEMBL
Assay Description
Inhibition of human FAP
Bioorg Med Chem 17: 2388-99 (2009)
Article DOI: 10.1016/j.bmc.2009.02.020
BindingDB Entry DOI: 10.7270/Q2416WZS
Dipeptidyl peptidase 4
(Homo sapiens (Human))
BDBM50248694
(3-({2-[(2S,4S)-2-Cyano-4-fluoropyrrolidin-1-yl]-2-...)
Show SMILES CC(C)(CC(=O)N[C@H]1C[C@@H]1c1cccc(OC(F)(F)F)c1)NCC(=O)N1C[C@@H](F)C[C@H]1C#N |r|
Show InChI InChI=1S/C22H26F4N4O3/c1-21(2,28-11-20(32)30-12-14(23)7-15(30)10-27)9-19(31)29-18-8-17(18)13-4-3-5-16(6-13)33-22(24,25)26/h3-6,14-15,17-18,28H,7-9,11-12H2,1-2H3,(H,29,31)/t14-,15-,17+,18-/m0/s1
Reactome pathway
n/an/a 20n/an/an/an/an/an/a
National Health Research Institutes
Curated by ChEMBL
Assay Description
Inhibition of human DPP4
Bioorg Med Chem 17: 2388-99 (2009)
Article DOI: 10.1016/j.bmc.2009.02.020
BindingDB Entry DOI: 10.7270/Q2416WZS
Dipeptidyl peptidase 2 (DPP II)
(Homo sapiens (Human))
BDBM50248694
(3-({2-[(2S,4S)-2-Cyano-4-fluoropyrrolidin-1-yl]-2-...)
Show SMILES CC(C)(CC(=O)N[C@H]1C[C@@H]1c1cccc(OC(F)(F)F)c1)NCC(=O)N1C[C@@H](F)C[C@H]1C#N |r|
Show InChI InChI=1S/C22H26F4N4O3/c1-21(2,28-11-20(32)30-12-14(23)7-15(30)10-27)9-19(31)29-18-8-17(18)13-4-3-5-16(6-13)33-22(24,25)26/h3-6,14-15,17-18,28H,7-9,11-12H2,1-2H3,(H,29,31)/t14-,15-,17+,18-/m0/s1
n/an/a>2.00E+4n/an/an/an/an/an/a
National Health Research Institutes
Curated by ChEMBL
Assay Description
Inhibition of human DPP2
Bioorg Med Chem 17: 2388-99 (2009)
Article DOI: 10.1016/j.bmc.2009.02.020
BindingDB Entry DOI: 10.7270/Q2416WZS
Dipeptidyl peptidase VIII
(Homo sapiens (Human))
BDBM50248694
(3-({2-[(2S,4S)-2-Cyano-4-fluoropyrrolidin-1-yl]-2-...)
Show SMILES CC(C)(CC(=O)N[C@H]1C[C@@H]1c1cccc(OC(F)(F)F)c1)NCC(=O)N1C[C@@H](F)C[C@H]1C#N |r|
Show InChI InChI=1S/C22H26F4N4O3/c1-21(2,28-11-20(32)30-12-14(23)7-15(30)10-27)9-19(31)29-18-8-17(18)13-4-3-5-16(6-13)33-22(24,25)26/h3-6,14-15,17-18,28H,7-9,11-12H2,1-2H3,(H,29,31)/t14-,15-,17+,18-/m0/s1
n/an/a>2.00E+4n/an/an/an/an/an/a
National Health Research Institutes
Curated by ChEMBL
Assay Description
Inhibition of human DPP8
Bioorg Med Chem 17: 2388-99 (2009)
Article DOI: 10.1016/j.bmc.2009.02.020
BindingDB Entry DOI: 10.7270/Q2416WZS