BDBM50248871 CHEMBL4091435
SMILES: O=C1NC(=S)S\C1=C/c1cccc2ccsc12
InChI Key: InChIKey=BQTRLDNYLGWEBO-TWGQIWQCSA-N
Data: 1 IC50
Activity Spreadsheet -- Enzyme Inhibition Constant Data from BindingDB
Found 1 hit for monomerid = 50248871
Trg + Lig
Ki
nM
ΔG°
kcal/mole
IC50
nM
Kd
nM
EC50/IC50
nM
koff
s-1
kon
M-1s-1
pHTemp
°C
Serine/threonine-protein kinase pim-1
(Homo sapiens (Human))
BDBM50248871
(CHEMBL4091435)
Show SMILES O=C1NC(=S)S\C1=C/c1cccc2ccsc12
Show InChI InChI=1S/C12H7NOS3/c14-11-9(17-12(15)13-11)6-8-3-1-2-7-4-5-16-10(7)8/h1-6H,(H,13,14,15)/b9-6-
n/an/a 68n/an/an/an/an/an/a
University of Oxford
Curated by ChEMBL
Assay Description
Inhibition of recombinant PIM1 (unknown origin) by pyruvate kinase/lactate dehydrogenase-coupled assay
Bioorg Med Chem 25: 2657-2665 (2017)
Article DOI: 10.1016/j.bmc.2017.02.056
BindingDB Entry DOI: 10.7270/Q2CV4M5V