BDBM50248901 CHEMBL4075979
SMILES: COc1ccccc1-c1nc(\C=C2/SC(=S)NC2=O)cs1
InChI Key: InChIKey=NSLSITPWYINOFU-WDZFZDKYSA-N
Data: 1 IC50
Activity Spreadsheet -- Enzyme Inhibition Constant Data from BindingDB
Found 1 hit for monomerid = 50248901
Trg + Lig
Ki
nM
ΔG°
kcal/mole
IC50
nM
Kd
nM
EC50/IC50
nM
koff
s-1
kon
M-1s-1
pHTemp
°C
Serine/threonine-protein kinase pim-1
(Homo sapiens (Human))
BDBM50248901
(CHEMBL4075979)
Show SMILES COc1ccccc1-c1nc(\C=C2/SC(=S)NC2=O)cs1
Show InChI InChI=1S/C14H10N2O2S3/c1-18-10-5-3-2-4-9(10)13-15-8(7-20-13)6-11-12(17)16-14(19)21-11/h2-7H,1H3,(H,16,17,19)/b11-6-
n/an/a 11n/an/an/an/an/an/a
University of Oxford
Curated by ChEMBL
Assay Description
Inhibition of recombinant PIM1 (unknown origin) by pyruvate kinase/lactate dehydrogenase-coupled assay
Bioorg Med Chem 25: 2657-2665 (2017)
Article DOI: 10.1016/j.bmc.2017.02.056
BindingDB Entry DOI: 10.7270/Q2CV4M5V