BDBM50248912 CHEMBL4069325
SMILES: O=C1NC(=S)S\C1=C/c1coc2ccccc12
InChI Key: InChIKey=HQJUZPNMTYFBMY-YHYXMXQVSA-N
Data: 1 IC50
Activity Spreadsheet -- Enzyme Inhibition Constant Data from BindingDB
Found 1 hit for monomerid = 50248912
Trg + Lig
Ki
nM
ΔG°
kcal/mole
IC50
nM
Kd
nM
EC50/IC50
nM
koff
s-1
kon
M-1s-1
pHTemp
°C
Serine/threonine-protein kinase pim-1
(Homo sapiens (Human))
BDBM50248912
(CHEMBL4069325)
Show SMILES O=C1NC(=S)S\C1=C/c1coc2ccccc12
Show InChI InChI=1S/C12H7NO2S2/c14-11-10(17-12(16)13-11)5-7-6-15-9-4-2-1-3-8(7)9/h1-6H,(H,13,14,16)/b10-5-
n/an/a 156n/an/an/an/an/an/a
University of Oxford
Curated by ChEMBL
Assay Description
Inhibition of recombinant PIM1 (unknown origin) by pyruvate kinase/lactate dehydrogenase-coupled assay
Bioorg Med Chem 25: 2657-2665 (2017)
Article DOI: 10.1016/j.bmc.2017.02.056
BindingDB Entry DOI: 10.7270/Q2CV4M5V