BDBM50248936 CHEMBL4083922::US10981896, Compound 25
SMILES: CNC(=O)c1ccc2NC(=O)\C(=C(/Nc3ccc(cc3)N(C)C(=O)CN3CCN(C)CC3)c3ccccc3)c2c1
InChI Key: InChIKey=JWSARCOTGLCHON-ZIADKAODSA-N
Data: 1 KI  3 IC50
Activity Spreadsheet -- Enzyme Inhibition Constant Data from BindingDB
Found 4 hits for monomerid = 50248936
Trg + Lig
Ki
nM
ΔG°
kcal/mole
IC50
nM
Kd
nM
EC50/IC50
nM
koff
s-1
kon
M-1s-1
pHTemp
°C
Maternal embryonic leucine zipper kinase
(Homo sapiens (Human))
BDBM50248936
(CHEMBL4083922 | US10981896, Compound 25)
Show SMILES CNC(=O)c1ccc2NC(=O)\C(=C(/Nc3ccc(cc3)N(C)C(=O)CN3CCN(C)CC3)c3ccccc3)c2c1
Show InChI InChI=1S/C31H34N6O3/c1-32-30(39)22-9-14-26-25(19-22)28(31(40)34-26)29(21-7-5-4-6-8-21)33-23-10-12-24(13-11-23)36(3)27(38)20-37-17-15-35(2)16-18-37/h4-14,19,33H,15-18,20H2,1-3H3,(H,32,39)(H,34,40)/b29-28-
2.30n/an/an/an/an/an/an/an/a
The University of Texas at Austin
Curated by ChEMBL
Assay Description
Inhibition of His6-tagged MELK catalytic domain (1 to 340 residues) (unknown origin) expressed in Escherichia coli BL21 (DE3) cells using Bcl-GL as s...
Bioorg Med Chem 25: 2609-2616 (2017)
Article DOI: 10.1016/j.bmc.2017.03.018
BindingDB Entry DOI: 10.7270/Q2833VFF
Maternal embryonic leucine zipper kinase
(Homo sapiens (Human))
BDBM50248936
(CHEMBL4083922 | US10981896, Compound 25)
Show SMILES CNC(=O)c1ccc2NC(=O)\C(=C(/Nc3ccc(cc3)N(C)C(=O)CN3CCN(C)CC3)c3ccccc3)c2c1
Show InChI InChI=1S/C31H34N6O3/c1-32-30(39)22-9-14-26-25(19-22)28(31(40)34-26)29(21-7-5-4-6-8-21)33-23-10-12-24(13-11-23)36(3)27(38)20-37-17-15-35(2)16-18-37/h4-14,19,33H,15-18,20H2,1-3H3,(H,32,39)(H,34,40)/b29-28-
US Patent
n/an/a 18n/an/an/an/an/an/a
BOARD OF REGENTS, THE UNIVERSITY OF TEXAS SYSTEM
US Patent
Assay Description
The top 10 hits from the 1 μM screening and derivatives of MELK-In-1 were subjected to the same assay conditions with varied inhibitor concentra...
US Patent US10981896 (2021)
Maternal embryonic leucine zipper kinase
(Homo sapiens (Human))
BDBM50248936
(CHEMBL4083922 | US10981896, Compound 25)
Show SMILES CNC(=O)c1ccc2NC(=O)\C(=C(/Nc3ccc(cc3)N(C)C(=O)CN3CCN(C)CC3)c3ccccc3)c2c1
Show InChI InChI=1S/C31H34N6O3/c1-32-30(39)22-9-14-26-25(19-22)28(31(40)34-26)29(21-7-5-4-6-8-21)33-23-10-12-24(13-11-23)36(3)27(38)20-37-17-15-35(2)16-18-37/h4-14,19,33H,15-18,20H2,1-3H3,(H,32,39)(H,34,40)/b29-28-
US Patent
n/an/a 67n/an/an/an/an/an/a
BOARD OF REGENTS, THE UNIVERSITY OF TEXAS SYSTEM
US Patent
Assay Description
The top 10 hits from the 1 μM screening and derivatives of MELK-In-1 were subjected to the same assay conditions with varied inhibitor concentra...
US Patent US10981896 (2021)
Maternal embryonic leucine zipper kinase
(Homo sapiens (Human))
BDBM50248936
(CHEMBL4083922 | US10981896, Compound 25)
Show SMILES CNC(=O)c1ccc2NC(=O)\C(=C(/Nc3ccc(cc3)N(C)C(=O)CN3CCN(C)CC3)c3ccccc3)c2c1
Show InChI InChI=1S/C31H34N6O3/c1-32-30(39)22-9-14-26-25(19-22)28(31(40)34-26)29(21-7-5-4-6-8-21)33-23-10-12-24(13-11-23)36(3)27(38)20-37-17-15-35(2)16-18-37/h4-14,19,33H,15-18,20H2,1-3H3,(H,32,39)(H,34,40)/b29-28-
n/an/a 18n/an/an/an/an/an/a
The University of Texas at Austin
Curated by ChEMBL
Assay Description
Inhibition of His6-tagged MELK catalytic domain (1 to 340 residues) (unknown origin) expressed in Escherichia coli BL21 (DE3) cells using Bcl-GL as s...
Bioorg Med Chem 25: 2609-2616 (2017)
Article DOI: 10.1016/j.bmc.2017.03.018
BindingDB Entry DOI: 10.7270/Q2833VFF