BDBM50249052 3-({2-[(2S,4S)-2-Cyano-4-fluoropyrrolidin-1-yl]-2-oxoethyl}amino)-3-methyl-N-[trans-2-(pyridin-3-yl)cyclopropyl]butanamide::CHEMBL472797
SMILES: CC(C)(CC(=O)N[C@H]1C[C@@H]1c1cccnc1)NCC(=O)N1C[C@@H](F)C[C@H]1C#N
InChI Key: InChIKey=CVMNWTRSQUBGFS-NXOAAHMSSA-N
Data: 4 IC50
Activity Spreadsheet -- Enzyme Inhibition Constant Data from BindingDB
Found 4 hits for monomerid = 50249052
Trg + Lig
Ki
nM
ΔG°
kcal/mole
IC50
nM
Kd
nM
EC50/IC50
nM
koff
s-1
kon
M-1s-1
pHTemp
°C
Fibroblast activation protein alpha
(Homo sapiens (Human))
BDBM50249052
(3-({2-[(2S,4S)-2-Cyano-4-fluoropyrrolidin-1-yl]-2-...)
Show SMILES CC(C)(CC(=O)N[C@H]1C[C@@H]1c1cccnc1)NCC(=O)N1C[C@@H](F)C[C@H]1C#N |r|
Show InChI InChI=1S/C20H26FN5O2/c1-20(2,24-11-19(28)26-12-14(21)6-15(26)9-22)8-18(27)25-17-7-16(17)13-4-3-5-23-10-13/h3-5,10,14-17,24H,6-8,11-12H2,1-2H3,(H,25,27)/t14-,15-,16+,17-/m0/s1
n/an/a>2.00E+4n/an/an/an/an/an/a
National Health Research Institutes
Curated by ChEMBL
Assay Description
Inhibition of human FAP
Bioorg Med Chem 17: 2388-99 (2009)
Article DOI: 10.1016/j.bmc.2009.02.020
BindingDB Entry DOI: 10.7270/Q2416WZS
Dipeptidyl peptidase 4
(Homo sapiens (Human))
BDBM50249052
(3-({2-[(2S,4S)-2-Cyano-4-fluoropyrrolidin-1-yl]-2-...)
Show SMILES CC(C)(CC(=O)N[C@H]1C[C@@H]1c1cccnc1)NCC(=O)N1C[C@@H](F)C[C@H]1C#N |r|
Show InChI InChI=1S/C20H26FN5O2/c1-20(2,24-11-19(28)26-12-14(21)6-15(26)9-22)8-18(27)25-17-7-16(17)13-4-3-5-23-10-13/h3-5,10,14-17,24H,6-8,11-12H2,1-2H3,(H,25,27)/t14-,15-,16+,17-/m0/s1
Reactome pathway
n/an/a 24n/an/an/an/an/an/a
National Health Research Institutes
Curated by ChEMBL
Assay Description
Inhibition of human DPP4
Bioorg Med Chem 17: 2388-99 (2009)
Article DOI: 10.1016/j.bmc.2009.02.020
BindingDB Entry DOI: 10.7270/Q2416WZS
Dipeptidyl peptidase 2 (DPP II)
(Homo sapiens (Human))
BDBM50249052
(3-({2-[(2S,4S)-2-Cyano-4-fluoropyrrolidin-1-yl]-2-...)
Show SMILES CC(C)(CC(=O)N[C@H]1C[C@@H]1c1cccnc1)NCC(=O)N1C[C@@H](F)C[C@H]1C#N |r|
Show InChI InChI=1S/C20H26FN5O2/c1-20(2,24-11-19(28)26-12-14(21)6-15(26)9-22)8-18(27)25-17-7-16(17)13-4-3-5-23-10-13/h3-5,10,14-17,24H,6-8,11-12H2,1-2H3,(H,25,27)/t14-,15-,16+,17-/m0/s1
n/an/a>2.00E+4n/an/an/an/an/an/a
National Health Research Institutes
Curated by ChEMBL
Assay Description
Inhibition of human DPP2
Bioorg Med Chem 17: 2388-99 (2009)
Article DOI: 10.1016/j.bmc.2009.02.020
BindingDB Entry DOI: 10.7270/Q2416WZS
Dipeptidyl peptidase VIII
(Homo sapiens (Human))
BDBM50249052
(3-({2-[(2S,4S)-2-Cyano-4-fluoropyrrolidin-1-yl]-2-...)
Show SMILES CC(C)(CC(=O)N[C@H]1C[C@@H]1c1cccnc1)NCC(=O)N1C[C@@H](F)C[C@H]1C#N |r|
Show InChI InChI=1S/C20H26FN5O2/c1-20(2,24-11-19(28)26-12-14(21)6-15(26)9-22)8-18(27)25-17-7-16(17)13-4-3-5-23-10-13/h3-5,10,14-17,24H,6-8,11-12H2,1-2H3,(H,25,27)/t14-,15-,16+,17-/m0/s1
n/an/a>2.00E+4n/an/an/an/an/an/a
National Health Research Institutes
Curated by ChEMBL
Assay Description
Inhibition of human DPP8
Bioorg Med Chem 17: 2388-99 (2009)
Article DOI: 10.1016/j.bmc.2009.02.020
BindingDB Entry DOI: 10.7270/Q2416WZS