BDBM50249121 CHEMBL472778::N-(4-chloro-2-(5-chloropyridin-2-ylcarbamoyl)phenyl)-4-(N,N-dimethylcarbamimidoyl)-2-methoxybenzamide
SMILES: COc1cc(ccc1C(=O)Nc1ccc(Cl)cc1C(=O)Nc1ccc(Cl)cn1)C(=N)N(C)C
InChI Key: InChIKey=LSMJZFDWGCGIDB-UHFFFAOYSA-N
Data: 1 IC50
Activity Spreadsheet -- Enzyme Inhibition Constant Data from BindingDB
Found 1 hit for monomerid = 50249121
Trg + Lig
Ki
nM
ΔG°
kcal/mole
IC50
nM
Kd
nM
EC50/IC50
nM
koff
s-1
kon
M-1s-1
pHTemp
°C
Coagulation factor X
(Homo sapiens (Human))
BDBM50249121
(CHEMBL472778 | N-(4-chloro-2-(5-chloropyridin-2-yl...)
Show SMILES COc1cc(ccc1C(=O)Nc1ccc(Cl)cc1C(=O)Nc1ccc(Cl)cn1)C(=N)N(C)C
Show InChI InChI=1S/C23H21Cl2N5O3/c1-30(2)21(26)13-4-7-16(19(10-13)33-3)22(31)28-18-8-5-14(24)11-17(18)23(32)29-20-9-6-15(25)12-27-20/h4-12,26H,1-3H3,(H,28,31)(H,27,29,32)
Reactome pathway
n/an/a 0.5n/an/an/an/an/an/a
Millennium Pharmaceuticals, Inc
Curated by ChEMBL
Assay Description
Inhibition of Factor 10a (unknown origin)
Bioorg Med Chem Lett 19: 2179-85 (2009)
Article DOI: 10.1016/j.bmcl.2009.02.111
BindingDB Entry DOI: 10.7270/Q22Z15F5