BDBM50249123 5-chloro-N-(5-chloropyridin-2-yl)-2-(4-(N-ethyl-N-methylcarbamimidoyl)benzamido)benzamide::CHEMBL515551
SMILES: CCN(C)C(=N)c1ccc(cc1)C(=O)Nc1ccc(Cl)cc1C(=O)Nc1ccc(Cl)cn1
InChI Key: InChIKey=LLAMURYENJSSJE-UHFFFAOYSA-N
Data: 1 IC50
Activity Spreadsheet -- Enzyme Inhibition Constant Data from BindingDB
Found 1 hit for monomerid = 50249123
Trg + Lig
Ki
nM
ΔG°
kcal/mole
IC50
nM
Kd
nM
EC50/IC50
nM
koff
s-1
kon
M-1s-1
pHTemp
°C
Coagulation factor X
(Homo sapiens (Human))
BDBM50249123
(5-chloro-N-(5-chloropyridin-2-yl)-2-(4-(N-ethyl-N-...)
Show SMILES CCN(C)C(=N)c1ccc(cc1)C(=O)Nc1ccc(Cl)cc1C(=O)Nc1ccc(Cl)cn1
Show InChI InChI=1S/C23H21Cl2N5O2/c1-3-30(2)21(26)14-4-6-15(7-5-14)22(31)28-19-10-8-16(24)12-18(19)23(32)29-20-11-9-17(25)13-27-20/h4-13,26H,3H2,1-2H3,(H,28,31)(H,27,29,32)
Reactome pathway
n/an/a 0.900n/an/an/an/an/an/a
Millennium Pharmaceuticals, Inc
Curated by ChEMBL
Assay Description
Inhibition of Factor 10a (unknown origin)
Bioorg Med Chem Lett 19: 2179-85 (2009)
Article DOI: 10.1016/j.bmcl.2009.02.111
BindingDB Entry DOI: 10.7270/Q22Z15F5