BDBM50249227 CHEMBL4095422
SMILES: Cc1nsc(n1)N1CCC2(CCN(C[C@H](O)c3ccc4C(=O)OCc4c3C)CC2)C1=O
InChI Key: InChIKey=DZXBVRHVPOKTJP-SFHVURJKSA-N
Data: 4 IC50
Activity Spreadsheet -- Enzyme Inhibition Constant Data from BindingDB
Found 4 hits for monomerid = 50249227
Trg + Lig
Ki
nM
ΔG°
kcal/mole
IC50
nM
Kd
nM
EC50/IC50
nM
koff
s-1
kon
M-1s-1
pHTemp
°C
1,3-beta-glucan synthase component GLS2
(Saccharomyces cerevisiae)
BDBM50249227
(CHEMBL4095422)
Show SMILES Cc1nsc(n1)N1CCC2(CCN(C[C@H](O)c3ccc4C(=O)OCc4c3C)CC2)C1=O |r|
Show InChI InChI=1S/C22H26N4O4S/c1-13-15(3-4-16-17(13)12-30-19(16)28)18(27)11-25-8-5-22(6-9-25)7-10-26(20(22)29)21-23-14(2)24-31-21/h3-4,18,27H,5-12H2,1-2H3/t18-/m0/s1
n/an/a 1.45E+4n/an/an/an/an/an/a
Merck& Co.
Curated by ChEMBL
Assay Description
Displacement of [35S]MK499 from human ERG expressed in HEK293 cells
Bioorg Med Chem Lett 27: 2559-2566 (2017)
Article DOI: 10.1016/j.bmcl.2017.03.086
BindingDB Entry DOI: 10.7270/Q2BV7K1G
1,3-beta-glucan synthase component GLS2
(Saccharomyces cerevisiae)
BDBM50249227
(CHEMBL4095422)
Show SMILES Cc1nsc(n1)N1CCC2(CCN(C[C@H](O)c3ccc4C(=O)OCc4c3C)CC2)C1=O |r|
Show InChI InChI=1S/C22H26N4O4S/c1-13-15(3-4-16-17(13)12-30-19(16)28)18(27)11-25-8-5-22(6-9-25)7-10-26(20(22)29)21-23-14(2)24-31-21/h3-4,18,27H,5-12H2,1-2H3/t18-/m0/s1
n/an/a 9.00E+3n/an/an/an/an/an/a
Merck& Co.
Curated by ChEMBL
Assay Description
Inhibition of human ERG by Qpatch electrophysiology method
Bioorg Med Chem Lett 27: 2559-2566 (2017)
Article DOI: 10.1016/j.bmcl.2017.03.086
BindingDB Entry DOI: 10.7270/Q2BV7K1G
ATP-sensitive inward rectifier potassium channel 1
(Homo sapiens (Human))
BDBM50249227
(CHEMBL4095422)
Show SMILES Cc1nsc(n1)N1CCC2(CCN(C[C@H](O)c3ccc4C(=O)OCc4c3C)CC2)C1=O |r|
Show InChI InChI=1S/C22H26N4O4S/c1-13-15(3-4-16-17(13)12-30-19(16)28)18(27)11-25-8-5-22(6-9-25)7-10-26(20(22)29)21-23-14(2)24-31-21/h3-4,18,27H,5-12H2,1-2H3/t18-/m0/s1
Reactome pathway
n/an/a 8n/an/an/an/an/an/a
Merck& Co.
Curated by ChEMBL
Assay Description
Inhibition of human ROMK expressed in CHO cells at -70 mV holding potential after 6 mins by whole cell patch clamp Qpatch method
Bioorg Med Chem Lett 27: 2559-2566 (2017)
Article DOI: 10.1016/j.bmcl.2017.03.086
BindingDB Entry DOI: 10.7270/Q2BV7K1G
ATP-sensitive inward rectifier potassium channel 1
(Homo sapiens (Human))
BDBM50249227
(CHEMBL4095422)
Show SMILES Cc1nsc(n1)N1CCC2(CCN(C[C@H](O)c3ccc4C(=O)OCc4c3C)CC2)C1=O |r|
Show InChI InChI=1S/C22H26N4O4S/c1-13-15(3-4-16-17(13)12-30-19(16)28)18(27)11-25-8-5-22(6-9-25)7-10-26(20(22)29)21-23-14(2)24-31-21/h3-4,18,27H,5-12H2,1-2H3/t18-/m0/s1
Reactome pathway
n/an/a 37n/an/an/an/an/an/a
Merck& Co.
Curated by ChEMBL
Assay Description
Inhibition of human ROMK channel expressed in HEK293 cells after 30 mins by FLIPR based thallium flux assay
Bioorg Med Chem Lett 27: 2559-2566 (2017)
Article DOI: 10.1016/j.bmcl.2017.03.086
BindingDB Entry DOI: 10.7270/Q2BV7K1G