BDBM50249362 5-chloro-N-(5-chloropyridin-2-yl)-2-(4-(N,N-dimethylcarbamimidoyl)-3-fluorobenzamido)benzamide::CHEMBL471583
SMILES: CN(C)C(=N)c1ccc(cc1F)C(=O)Nc1ccc(Cl)cc1C(=O)Nc1ccc(Cl)cn1
InChI Key: InChIKey=RFGCCMAUSNBICP-UHFFFAOYSA-N
Data: 1 IC50
Activity Spreadsheet -- Enzyme Inhibition Constant Data from BindingDB
Found 1 hit for monomerid = 50249362
Trg + Lig
Ki
nM
ΔG°
kcal/mole
IC50
nM
Kd
nM
EC50/IC50
nM
koff
s-1
kon
M-1s-1
pHTemp
°C
Coagulation factor X
(Homo sapiens (Human))
BDBM50249362
(5-chloro-N-(5-chloropyridin-2-yl)-2-(4-(N,N-dimeth...)
Show SMILES CN(C)C(=N)c1ccc(cc1F)C(=O)Nc1ccc(Cl)cc1C(=O)Nc1ccc(Cl)cn1
Show InChI InChI=1S/C22H18Cl2FN5O2/c1-30(2)20(26)15-6-3-12(9-17(15)25)21(31)28-18-7-4-13(23)10-16(18)22(32)29-19-8-5-14(24)11-27-19/h3-11,26H,1-2H3,(H,28,31)(H,27,29,32)
Reactome pathway
n/an/a 1.10n/an/an/an/an/an/a
Millennium Pharmaceuticals, Inc
Curated by ChEMBL
Assay Description
Inhibition of Factor 10a (unknown origin)
Bioorg Med Chem Lett 19: 2179-85 (2009)
Article DOI: 10.1016/j.bmcl.2009.02.111
BindingDB Entry DOI: 10.7270/Q22Z15F5