BDBM50249364 CHEMBL470735::N-(4-chloro-2-(5-chloropyridin-2-ylcarbamoyl)phenyl)-4-(N,N-dimethylcarbamimidoyl)-2-(pyrrolidin-1-yl)benzamide
SMILES: CN(C)C(=N)c1ccc(C(=O)Nc2ccc(Cl)cc2C(=O)Nc2ccc(Cl)cn2)c(c1)N1CCCC1
InChI Key: InChIKey=GDLOFIAJCMVIPD-UHFFFAOYSA-N
Data: 1 IC50
Activity Spreadsheet -- Enzyme Inhibition Constant Data from BindingDB
Found 1 hit for monomerid = 50249364
Trg + Lig
Ki
nM
ΔG°
kcal/mole
IC50
nM
Kd
nM
EC50/IC50
nM
koff
s-1
kon
M-1s-1
pHTemp
°C
Coagulation factor X
(Homo sapiens (Human))
BDBM50249364
(CHEMBL470735 | N-(4-chloro-2-(5-chloropyridin-2-yl...)
Show SMILES CN(C)C(=N)c1ccc(C(=O)Nc2ccc(Cl)cc2C(=O)Nc2ccc(Cl)cn2)c(c1)N1CCCC1
Show InChI InChI=1S/C26H26Cl2N6O2/c1-33(2)24(29)16-5-8-19(22(13-16)34-11-3-4-12-34)25(35)31-21-9-6-17(27)14-20(21)26(36)32-23-10-7-18(28)15-30-23/h5-10,13-15,29H,3-4,11-12H2,1-2H3,(H,31,35)(H,30,32,36)
Reactome pathway
n/an/a 2n/an/an/an/an/an/a
Millennium Pharmaceuticals, Inc
Curated by ChEMBL
Assay Description
Inhibition of Factor 10a (unknown origin)
Bioorg Med Chem Lett 19: 2179-85 (2009)
Article DOI: 10.1016/j.bmcl.2009.02.111
BindingDB Entry DOI: 10.7270/Q22Z15F5