BDBM50249390 CHEMBL514501::N-(4-chloro-2-(5-chloropyridin-2-ylcarbamoyl)phenyl)-6-(N,N-dimethylcarbamimidoyl)nicotinamide
SMILES: CN(C)C(=N)c1ccc(cn1)C(=O)Nc1ccc(Cl)cc1C(=O)Nc1ccc(Cl)cn1
InChI Key: InChIKey=YHGLLYUUPOBKQI-UHFFFAOYSA-N
Data: 1 IC50
Activity Spreadsheet -- Enzyme Inhibition Constant Data from BindingDB
Found 1 hit for monomerid = 50249390
Trg + Lig
Ki
nM
ΔG°
kcal/mole
IC50
nM
Kd
nM
EC50/IC50
nM
koff
s-1
kon
M-1s-1
pHTemp
°C
Coagulation factor X
(Homo sapiens (Human))
BDBM50249390
(CHEMBL514501 | N-(4-chloro-2-(5-chloropyridin-2-yl...)
Show SMILES CN(C)C(=N)c1ccc(cn1)C(=O)Nc1ccc(Cl)cc1C(=O)Nc1ccc(Cl)cn1
Show InChI InChI=1S/C21H18Cl2N6O2/c1-29(2)19(24)17-6-3-12(10-25-17)20(30)27-16-7-4-13(22)9-15(16)21(31)28-18-8-5-14(23)11-26-18/h3-11,24H,1-2H3,(H,27,30)(H,26,28,31)
Reactome pathway
n/an/a 3n/an/an/an/an/an/a
Millennium Pharmaceuticals, Inc
Curated by ChEMBL
Assay Description
Inhibition of Factor 10a (unknown origin)
Bioorg Med Chem Lett 19: 2179-85 (2009)
Article DOI: 10.1016/j.bmcl.2009.02.111
BindingDB Entry DOI: 10.7270/Q22Z15F5