BDBM50249520 CHEMBL516246::N-(4-chloro-3-(5-(dimethylamino)-1H-benzo[d]imidazol-2-yl)phenyl)-3,5-dimethoxybenzamide::N-(4-chloro-3-(6-(dimethylamino)-1H-benzo[d]imidazol-2-yl)phenyl)-3,5-dimethoxybenzamide
SMILES: COc1cc(OC)cc(c1)C(=O)Nc1ccc(Cl)c(c1)-c1nc2ccc(cc2[nH]1)N(C)C
InChI Key: InChIKey=UBHJFPVTEATUFS-UHFFFAOYSA-N
Data: 1 IC50  1 EC50
Activity Spreadsheet -- Enzyme Inhibition Constant Data from BindingDB
Found 2 hits for monomerid = 50249520
Trg + Lig
Ki
nM
ΔG°
kcal/mole
IC50
nM
Kd
nM
EC50/IC50
nM
koff
s-1
kon
M-1s-1
pHTemp
°C
Sonic hedgehog protein
(Mus musculus (Mouse))
BDBM50249520
(CHEMBL516246 | N-(4-chloro-3-(5-(dimethylamino)-1H...)
Show SMILES COc1cc(OC)cc(c1)C(=O)Nc1ccc(Cl)c(c1)-c1nc2ccc(cc2[nH]1)N(C)C
Show InChI InChI=1S/C24H23ClN4O3/c1-29(2)16-6-8-21-22(12-16)28-23(27-21)19-11-15(5-7-20(19)25)26-24(30)14-9-17(31-3)13-18(10-14)32-4/h5-13H,1-4H3,(H,26,30)(H,27,28)
n/an/an/an/a 40n/an/an/an/a
St. Jude Children's Research Hospital
Curated by ChEMBL
Assay Description
Inhibition of SHH in mouse Shh Light2 cells by GLI-responsive firefly luciferase reporter gene assay
J Med Chem 52: 3829-45 (2009)
Article DOI: 10.1021/jm801420y
BindingDB Entry DOI: 10.7270/Q22N536M
Smoothened homolog
(Mus musculus)
BDBM50249520
(CHEMBL516246 | N-(4-chloro-3-(5-(dimethylamino)-1H...)
Show SMILES COc1cc(OC)cc(c1)C(=O)Nc1ccc(Cl)c(c1)-c1nc2ccc(cc2[nH]1)N(C)C
Show InChI InChI=1S/C24H23ClN4O3/c1-29(2)16-6-8-21-22(12-16)28-23(27-21)19-11-15(5-7-20(19)25)26-24(30)14-9-17(31-3)13-18(10-14)32-4/h5-13H,1-4H3,(H,26,30)(H,27,28)
n/an/a 3n/an/an/an/an/an/a
Genomics Institute of the Novartis Research Foundation
Curated by ChEMBL
Assay Description
Antagonist activity at Smo in mouse TM3 cells expressing Hh12 assessed as inhibition of 1 nM Ag1.5-induced Gli expression incubated for 30 mins prior...
Bioorg Med Chem Lett 22: 6573-6 (2012)
Article DOI: 10.1016/j.bmcl.2012.09.013
BindingDB Entry DOI: 10.7270/Q2RB75PK