BDBM50249557 2,2'-(2-(pyridin-4-yl)dihydropyrimidine-1,3(2H,4H)-diyl)bis(methylene)bis(N,N-dimethylaniline)::2-((3-(2-(dimethylamino)benzyl)-2-(pyridin-4-yl)-tetrahydropyrimidin-1(2H)-yl)methyl)-N,N-dimethylbenzenamine::CHEMBL471728
SMILES: CN(C)c1ccccc1CN1CCCN(Cc2ccccc2N(C)C)C1c1ccncc1
InChI Key: InChIKey=KVQOGDQTWWCZFX-UHFFFAOYSA-N
Data: 3 IC50
Activity Spreadsheet -- Enzyme Inhibition Constant Data from BindingDB
Found 3 hits for monomerid = 50249557
Trg + Lig
Ki
nM
ΔG°
kcal/mole
IC50
nM
Kd
nM
EC50/IC50
nM
koff
s-1
kon
M-1s-1
pHTemp
°C
Sonic hedgehog protein
(Mus musculus (Mouse))
BDBM50249557
(2,2'-(2-(pyridin-4-yl)dihydropyrimidine-1,3(2H,4H)...)
Show SMILES CN(C)c1ccccc1CN1CCCN(Cc2ccccc2N(C)C)C1c1ccncc1
Show InChI InChI=1S/C27H35N5/c1-29(2)25-12-7-5-10-23(25)20-31-18-9-19-32(27(31)22-14-16-28-17-15-22)21-24-11-6-8-13-26(24)30(3)4/h5-8,10-17,27H,9,18-21H2,1-4H3
n/an/a 5.00E+3n/an/an/an/an/an/a
St. Jude Children's Research Hospital
Curated by ChEMBL
Assay Description
Inhibition of SHH in mouse Shh Light2 cells by GLI-responsive firefly luciferase reporter gene assay
J Med Chem 52: 3829-45 (2009)
Article DOI: 10.1021/jm801420y
BindingDB Entry DOI: 10.7270/Q22N536M
Zinc finger protein GLI1/GLI2
(Mus musculus)
BDBM50249557
(2,2'-(2-(pyridin-4-yl)dihydropyrimidine-1,3(2H,4H)...)
Show SMILES CN(C)c1ccccc1CN1CCCN(Cc2ccccc2N(C)C)C1c1ccncc1
Show InChI InChI=1S/C27H35N5/c1-29(2)25-12-7-5-10-23(25)20-31-18-9-19-32(27(31)22-14-16-28-17-15-22)21-24-11-6-8-13-26(24)30(3)4/h5-8,10-17,27H,9,18-21H2,1-4H3
n/an/a 5.00E+3n/an/an/an/an/an/a
Philipps University Marburg
Curated by ChEMBL
Assay Description
Inhibition of GLI1/GLI2 in mouse Shh Light2 cells assessed as reduction in endogenous hedgehog signalling in presence of Smo agonist SAG by luciferas...
J Med Chem 62: 8392-8411 (2019)
Article DOI: 10.1021/acs.jmedchem.9b00188
Zinc finger protein GLI1
(Homo sapiens (Human))
BDBM50249557
(2,2'-(2-(pyridin-4-yl)dihydropyrimidine-1,3(2H,4H)...)
Show SMILES CN(C)c1ccccc1CN1CCCN(Cc2ccccc2N(C)C)C1c1ccncc1
Show InChI InChI=1S/C27H35N5/c1-29(2)25-12-7-5-10-23(25)20-31-18-9-19-32(27(31)22-14-16-28-17-15-22)21-24-11-6-8-13-26(24)30(3)4/h5-8,10-17,27H,9,18-21H2,1-4H3
NCI pathway
Reactome pathway
n/an/a 4.00E+4n/an/an/an/an/an/a
St. Jude Children's Research Hospital
Curated by ChEMBL
Assay Description
Inhibition of human Gli1-mediated transcriptional activity in human Rh30 cells after 24 hrs by luciferase reporter gene assay
Bioorg Med Chem 18: 4801-11 (2011)
Article DOI: 10.1016/j.bmc.2010.05.001
BindingDB Entry DOI: 10.7270/Q23R0TTT