BDBM50249754 2-[(5S)-5-Ethyl-4,4-bis(4-fluorophenyl)-4,5-dihydro-1H-imidazol-2-yl]-4-pyridinecarbonitrile::CHEMBL522793
SMILES: CC[C@@H]1NC(=NC1(c1ccc(F)cc1)c1ccc(F)cc1)c1cc(ccn1)C#N
InChI Key: InChIKey=OEMCDHMYVREMSY-NRFANRHFSA-N
Data: 1 KI  1 IC50
Activity Spreadsheet -- Enzyme Inhibition Constant Data from BindingDB
Found 2 hits for monomerid = 50249754
Trg + Lig
Ki
nM
ΔG°
kcal/mole
IC50
nM
Kd
nM
EC50/IC50
nM
koff
s-1
kon
M-1s-1
pHTemp
°C
Neuropeptide Y receptor type 5 ( NPY Y5)
(Homo sapiens (Human))
BDBM50249754
(2-[(5S)-5-Ethyl-4,4-bis(4-fluorophenyl)-4,5-dihydr...)
Show SMILES CC[C@@H]1NC(=NC1(c1ccc(F)cc1)c1ccc(F)cc1)c1cc(ccn1)C#N |r,c:4|
Show InChI InChI=1S/C23H18F2N4/c1-2-21-23(16-3-7-18(24)8-4-16,17-5-9-19(25)10-6-17)29-22(28-21)20-13-15(14-26)11-12-27-20/h3-13,21H,2H2,1H3,(H,28,29)/t21-/m0/s1
2.60n/an/an/an/an/an/an/an/a
Tsukuba Research Institute
Curated by ChEMBL
Assay Description
Displacement of [125I]PYY from human recombinant neuropeptide Y5 receptor expressed in mouse LMtk- cells
J Med Chem 52: 3385-96 (2009)
Article DOI: 10.1021/jm900110t
BindingDB Entry DOI: 10.7270/Q2DN450G
Potassium voltage-gated channel subfamily H member 2
(Homo sapiens (Human))
BDBM50249754
(2-[(5S)-5-Ethyl-4,4-bis(4-fluorophenyl)-4,5-dihydr...)
Show SMILES CC[C@@H]1NC(=NC1(c1ccc(F)cc1)c1ccc(F)cc1)c1cc(ccn1)C#N |r,c:4|
Show InChI InChI=1S/C23H18F2N4/c1-2-21-23(16-3-7-18(24)8-4-16,17-5-9-19(25)10-6-17)29-22(28-21)20-13-15(14-26)11-12-27-20/h3-13,21H,2H2,1H3,(H,28,29)/t21-/m0/s1
Reactome pathway
n/an/a 490n/an/an/an/an/an/a
Tsukuba Research Institute
Curated by ChEMBL
Assay Description
Displacement of [35S]N-[(4R)-1'-[(2R)-6-cyano-1,2,3,4-tetrahydro-2-naphthyl]-3,4-dihydro-4-hydroxyspiro[2H-1-benzopyran-2,4'-piperidin]6-yl]methanesu...
J Med Chem 52: 3385-96 (2009)
Article DOI: 10.1021/jm900110t
BindingDB Entry DOI: 10.7270/Q2DN450G