BDBM50249779 3-[(4S,5S)-4-(4-Fluorophenyl)-4-(6-fluoro-3-pyridyl)-5-methyl-4,5-dihydro-1H-imidazol-2-yl]benzonitrile::CHEMBL521947
SMILES: C[C@@H]1NC(=N[C@@]1(c1ccc(F)cc1)c1ccc(F)nc1)c1cccc(c1)C#N
InChI Key: InChIKey=QQTGFLGQBAVTTH-FPTDNZKUSA-N
Data: 1 KI  1 IC50
Activity Spreadsheet -- Enzyme Inhibition Constant Data from BindingDB
Found 2 hits for monomerid = 50249779
Trg + Lig
Ki
nM
ΔG°
kcal/mole
IC50
nM
Kd
nM
EC50/IC50
nM
koff
s-1
kon
M-1s-1
pHTemp
°C
Neuropeptide Y receptor type 5 ( NPY Y5)
(Homo sapiens (Human))
BDBM50249779
(3-[(4S,5S)-4-(4-Fluorophenyl)-4-(6-fluoro-3-pyridy...)
Show SMILES C[C@@H]1NC(=N[C@@]1(c1ccc(F)cc1)c1ccc(F)nc1)c1cccc(c1)C#N |r,c:3|
Show InChI InChI=1S/C22H16F2N4/c1-14-22(17-5-8-19(23)9-6-17,18-7-10-20(24)26-13-18)28-21(27-14)16-4-2-3-15(11-16)12-25/h2-11,13-14H,1H3,(H,27,28)/t14-,22-/m0/s1
0.800n/an/an/an/an/an/an/an/a
Tsukuba Research Institute
Curated by ChEMBL
Assay Description
Displacement of [125I]PYY from human recombinant neuropeptide Y5 receptor expressed in mouse LMtk- cells
J Med Chem 52: 3385-96 (2009)
Article DOI: 10.1021/jm900110t
BindingDB Entry DOI: 10.7270/Q2DN450G
Potassium voltage-gated channel subfamily H member 2
(Homo sapiens (Human))
BDBM50249779
(3-[(4S,5S)-4-(4-Fluorophenyl)-4-(6-fluoro-3-pyridy...)
Show SMILES C[C@@H]1NC(=N[C@@]1(c1ccc(F)cc1)c1ccc(F)nc1)c1cccc(c1)C#N |r,c:3|
Show InChI InChI=1S/C22H16F2N4/c1-14-22(17-5-8-19(23)9-6-17,18-7-10-20(24)26-13-18)28-21(27-14)16-4-2-3-15(11-16)12-25/h2-11,13-14H,1H3,(H,27,28)/t14-,22-/m0/s1
Reactome pathway
n/an/a 4.33E+3n/an/an/an/an/an/a
Tsukuba Research Institute
Curated by ChEMBL
Assay Description
Displacement of [35S]N-[(4R)-1'-[(2R)-6-cyano-1,2,3,4-tetrahydro-2-naphthyl]-3,4-dihydro-4-hydroxyspiro[2H-1-benzopyran-2,4'-piperidin]6-yl]methanesu...
J Med Chem 52: 3385-96 (2009)
Article DOI: 10.1021/jm900110t
BindingDB Entry DOI: 10.7270/Q2DN450G