BDBM50249798 CHEMBL4059962
SMILES: COc1cc2n(C)c(=O)c(C)cc2cc1NS(=O)(=O)c1ccc(cc1)C#N
InChI Key: InChIKey=XULQOMADHZABKB-UHFFFAOYSA-N
Data: 3 IC50
Activity Spreadsheet -- Enzyme Inhibition Constant Data from BindingDB
Found 2 hits for monomerid = 50249798
Trg + Lig
Ki
nM
ΔG°
kcal/mole
IC50
nM
Kd
nM
EC50/IC50
nM
koff
s-1
kon
M-1s-1
pHTemp
°C
DNA gyrase subunit A/B
(Escherichia coli (strain K12))
BDBM50249798
(CHEMBL4795890)
Show SMILES COc1cc2n(C)c(=O)c(C)cc2cc1NS(=O)(=O)c1ccc(cc1)C#N
Show InChI InChI=1S/C19H17N3O4S/c1-12-8-14-9-16(18(26-3)10-17(14)22(2)19(12)23)21-27(24,25)15-6-4-13(11-20)5-7-15/h4-10,21H,1-3H3
n/an/a 6.90n/an/an/an/an/an/a
TBA
Assay Description
Evaluated for the percent binding affinity against H1 receptor by an H1 histamine-mediated bronchospasm
Citation and Details
DNA topoisomerase 4 subunit A/B
(Staphylococcus aureus)
BDBM50249798
(CHEMBL4795890)
Show SMILES COc1cc2n(C)c(=O)c(C)cc2cc1NS(=O)(=O)c1ccc(cc1)C#N
Show InChI InChI=1S/C19H17N3O4S/c1-12-8-14-9-16(18(26-3)10-17(14)22(2)19(12)23)21-27(24,25)15-6-4-13(11-20)5-7-15/h4-10,21H,1-3H3
n/an/a 960n/an/an/an/an/an/a
TBA
Assay Description
Inhibition of BRD4 bromodomain 1 (unknown origin) incubated in dark for 30 mins by TR-FRET assay
Citation and Details