null
SMILES: Cl.OC(=O)CNC(=O)c1ccc(NC(=O)c2cc(Br)c(Br)[nH]2)c(OC2CCNCC2)c1
InChI Key: InChIKey=VEDQFFLLEHNIDG-UHFFFAOYSA-N
Activity Spreadsheet -- Enzyme Inhibition Constant Data from BindingDB
Found 1 hit for monomerid = 50249820
Trg + Lig
Ki
nM
ΔG°
kcal/mole
IC50
nM
Kd
nM
EC50/IC50
nM
koff
s-1
kon
M-1s-1
pHTemp
°C
DNA gyrase subunit A/B
(Escherichia coli (strain K12))
BDBM50249820
(CHEMBL4779341)
Show SMILES Cl.OC(=O)CNC(=O)c1ccc(NC(=O)c2cc(Br)c(Br)[nH]2)c(OC2CCNCC2)c1
Show InChI InChI=1S/C20H19N3O4S/c1-13(2)27-19-11-18-15(6-9-20(24)23(18)3)10-17(19)22-28(25,26)16-7-4-14(12-21)5-8-16/h4-11,13,22H,1-3H3
n/an/a 20n/an/an/an/an/an/a
TBA
Assay Description
Evaluated for the percent binding affinity against H1 receptor by an H1 histamine-mediated bronchospasm
Citation and Details
Article DOI: 10.1016/j.ejmech.2019.02.004
BindingDB Entry DOI: 10.7270/Q23J3HK1