BDBM50249829 2-[(4S,5S)-4-(4-Fluorophenyl)-4-(6-fluoro-3-pyridyl)-5-methyl-4,5-dihydro-1H-imidazol-2-yl]-4-(methyloxy)pyridine::CHEMBL490902
SMILES: COc1ccnc(c1)C1=N[C@@]([C@H](C)N1)(c1ccc(F)cc1)c1ccc(F)nc1
InChI Key: InChIKey=WLYGSDPNZQUPGJ-ZSEKCTLFSA-N
Data: 1 KI  1 IC50
Activity Spreadsheet -- Enzyme Inhibition Constant Data from BindingDB
Found 2 hits for monomerid = 50249829
Trg + Lig
Ki
nM
ΔG°
kcal/mole
IC50
nM
Kd
nM
EC50/IC50
nM
koff
s-1
kon
M-1s-1
pHTemp
°C
Neuropeptide Y receptor type 5 ( NPY Y5)
(Homo sapiens (Human))
BDBM50249829
(2-[(4S,5S)-4-(4-Fluorophenyl)-4-(6-fluoro-3-pyridy...)
Show SMILES COc1ccnc(c1)C1=N[C@@]([C@H](C)N1)(c1ccc(F)cc1)c1ccc(F)nc1 |r,t:9|
Show InChI InChI=1S/C21H18F2N4O/c1-13-21(14-3-6-16(22)7-4-14,15-5-8-19(23)25-12-15)27-20(26-13)18-11-17(28-2)9-10-24-18/h3-13H,1-2H3,(H,26,27)/t13-,21-/m0/s1
2.5n/an/an/an/an/an/an/an/a
Tsukuba Research Institute
Curated by ChEMBL
Assay Description
Displacement of [125I]PYY from human recombinant neuropeptide Y5 receptor expressed in mouse LMtk- cells
J Med Chem 52: 3385-96 (2009)
Article DOI: 10.1021/jm900110t
BindingDB Entry DOI: 10.7270/Q2DN450G
Potassium voltage-gated channel subfamily H member 2
(Homo sapiens (Human))
BDBM50249829
(2-[(4S,5S)-4-(4-Fluorophenyl)-4-(6-fluoro-3-pyridy...)
Show SMILES COc1ccnc(c1)C1=N[C@@]([C@H](C)N1)(c1ccc(F)cc1)c1ccc(F)nc1 |r,t:9|
Show InChI InChI=1S/C21H18F2N4O/c1-13-21(14-3-6-16(22)7-4-14,15-5-8-19(23)25-12-15)27-20(26-13)18-11-17(28-2)9-10-24-18/h3-13H,1-2H3,(H,26,27)/t13-,21-/m0/s1
Reactome pathway
n/an/a 6.33E+3n/an/an/an/an/an/a
Tsukuba Research Institute
Curated by ChEMBL
Assay Description
Displacement of [35S]N-[(4R)-1'-[(2R)-6-cyano-1,2,3,4-tetrahydro-2-naphthyl]-3,4-dihydro-4-hydroxyspiro[2H-1-benzopyran-2,4'-piperidin]6-yl]methanesu...
J Med Chem 52: 3385-96 (2009)
Article DOI: 10.1021/jm900110t
BindingDB Entry DOI: 10.7270/Q2DN450G