null
SMILES: C[C@@H]1NC(=N[C@@]1(c1ccc(F)cc1)c1ccc(F)nc1)c1nccs1
InChI Key: InChIKey=IFOMXEHIJYZJDJ-VOJFVSQTSA-N
Activity Spreadsheet -- Enzyme Inhibition Constant Data from BindingDB
Found 2 hits for monomerid = 50249866
Trg + Lig
Ki
nM
ΔG°
kcal/mole
IC50
nM
Kd
nM
EC50/IC50
nM
koff
s-1
kon
M-1s-1
pHTemp
°C
Neuropeptide Y receptor type 5
(Homo sapiens (Human))
BDBM50249866
(2-Fluoro-5-[(4S,5S)-4-(4-fluorophenyl)-5-methyl-2-...)
Show SMILES C[C@@H]1NC(=N[C@@]1(c1ccc(F)cc1)c1ccc(F)nc1)c1nccs1 |r,c:3|
Show InChI InChI=1S/C18H14F2N4S/c1-11-18(12-2-5-14(19)6-3-12,13-4-7-15(20)22-10-13)24-16(23-11)17-21-8-9-25-17/h2-11H,1H3,(H,23,24)/t11-,18-/m0/s1
4.10n/an/an/an/an/an/an/an/a
Tsukuba Research Institute
Curated by ChEMBL
Assay Description
Displacement of [125I]PYY from human recombinant neuropeptide Y5 receptor expressed in mouse LMtk- cells
J Med Chem 52: 3385-96 (2009)
Article DOI: 10.1021/jm900110t
BindingDB Entry DOI: 10.7270/Q2DN450G
Potassium voltage-gated channel subfamily H member 2
(Homo sapiens (Human))
BDBM50249866
(2-Fluoro-5-[(4S,5S)-4-(4-fluorophenyl)-5-methyl-2-...)
Show SMILES C[C@@H]1NC(=N[C@@]1(c1ccc(F)cc1)c1ccc(F)nc1)c1nccs1 |r,c:3|
Show InChI InChI=1S/C18H14F2N4S/c1-11-18(12-2-5-14(19)6-3-12,13-4-7-15(20)22-10-13)24-16(23-11)17-21-8-9-25-17/h2-11H,1H3,(H,23,24)/t11-,18-/m0/s1
Reactome pathway
n/an/a>1.00E+4n/an/an/an/an/an/a
Tsukuba Research Institute
Curated by ChEMBL
Assay Description
Displacement of [35S]N-[(4R)-1'-[(2R)-6-cyano-1,2,3,4-tetrahydro-2-naphthyl]-3,4-dihydro-4-hydroxyspiro[2H-1-benzopyran-2,4'-piperidin]6-yl]methanesu...
J Med Chem 52: 3385-96 (2009)
Article DOI: 10.1021/jm900110t
BindingDB Entry DOI: 10.7270/Q2DN450G