BDBM50250003 CHEMBL4074754
SMILES: Nc1ncnc2n(CC3CCNCC3)cc(Sc3cccc(Cl)c3)c12
InChI Key: InChIKey=DHZOVUBXRCCMBB-UHFFFAOYSA-N
Data: 2 IC50
Activity Spreadsheet -- Enzyme Inhibition Constant Data from BindingDB
Found 2 hits for monomerid = 50250003
Trg + Lig
Ki
nM
ΔG°
kcal/mole
IC50
nM
Kd
nM
EC50/IC50
nM
koff
s-1
kon
M-1s-1
pHTemp
°C
Calmodulin-domain protein kinase 1 (CDPK1)
(Toxoplasma gondii)
BDBM50250003
(CHEMBL4074754)
Show SMILES Nc1ncnc2n(CC3CCNCC3)cc(Sc3cccc(Cl)c3)c12
Show InChI InChI=1S/C18H20ClN5S/c19-13-2-1-3-14(8-13)25-15-10-24(9-12-4-6-21-7-5-12)18-16(15)17(20)22-11-23-18/h1-3,8,10-12,21H,4-7,9H2,(H2,20,22,23)
n/an/a 14n/an/an/an/an/an/a
University of California
Curated by ChEMBL
Assay Description
Inhibition of C-terminal His-tagged full length Toxoplasma gondii CDPK1 expressed in Escherichia coli BL21 (DE3) using syntide-2 as substrate pre-inc...
J Med Chem 60: 9976-9989 (2017)
Article DOI: 10.1021/acs.jmedchem.7b01192
BindingDB Entry DOI: 10.7270/Q21G0PP0
Proto-oncogene tyrosine-protein kinase Src
(Homo sapiens (Human))
BDBM50250003
(CHEMBL4074754)
Show SMILES Nc1ncnc2n(CC3CCNCC3)cc(Sc3cccc(Cl)c3)c12
Show InChI InChI=1S/C18H20ClN5S/c19-13-2-1-3-14(8-13)25-15-10-24(9-12-4-6-21-7-5-12)18-16(15)17(20)22-11-23-18/h1-3,8,10-12,21H,4-7,9H2,(H2,20,22,23)
n/an/a>1.00E+4n/an/an/an/an/an/a
University of California
Curated by ChEMBL
Assay Description
Inhibition of human Src kinase domain (254 to 536 residues) expressed in Escherichia coli BL21 (DE3) using abltide as substrate pre-incubated for 10 ...
J Med Chem 60: 9976-9989 (2017)
Article DOI: 10.1021/acs.jmedchem.7b01192
BindingDB Entry DOI: 10.7270/Q21G0PP0