BDBM50250013 CHEMBL4095218
SMILES: Nc1ncnc2n(CC3CCNCC3)nc(Oc3ccc(F)c(Cl)c3)c12
InChI Key: InChIKey=NNQNLIXHDLUEKW-UHFFFAOYSA-N
Data: 2 IC50
Activity Spreadsheet -- Enzyme Inhibition Constant Data from BindingDB
Found 4 hits for monomerid = 50250013
Trg + Lig
Ki
nM
ΔG°
kcal/mole
IC50
nM
Kd
nM
EC50/IC50
nM
koff
s-1
kon
M-1s-1
pHTemp
°C
Proto-oncogene tyrosine-protein kinase Src
(Homo sapiens (Human))
BDBM50250013
(CHEMBL4095218 | US11208411, Compound GXJ261)
Show SMILES Nc1ncnc2n(CC3CCNCC3)nc(Oc3ccc(F)c(Cl)c3)c12
Show InChI InChI=1S/C17H18ClFN6O/c18-12-7-11(1-2-13(12)19)26-17-14-15(20)22-9-23-16(14)25(24-17)8-10-3-5-21-6-4-10/h1-2,7,9-10,21H,3-6,8H2,(H2,20,22,23)
n/an/a>1.00E+4n/an/an/an/an/an/a
University of California
Curated by ChEMBL
Assay Description
Inhibition of human Src kinase domain (254 to 536 residues) expressed in Escherichia coli BL21 (DE3) using abltide as substrate pre-incubated for 10 ...
J Med Chem 60: 9976-9989 (2017)
Article DOI: 10.1021/acs.jmedchem.7b01192
BindingDB Entry DOI: 10.7270/Q21G0PP0
Protein cereblon/Tyrosine-protein kinase SRC
(Homo sapiens (Human))
BDBM50250013
(CHEMBL4095218 | US11208411, Compound GXJ261)
Show SMILES Nc1ncnc2n(CC3CCNCC3)nc(Oc3ccc(F)c(Cl)c3)c12
Show InChI InChI=1S/C17H18ClFN6O/c18-12-7-11(1-2-13(12)19)26-17-14-15(20)22-9-23-16(14)25(24-17)8-10-3-5-21-6-4-10/h1-2,7,9-10,21H,3-6,8H2,(H2,20,22,23)
n/an/a>1.00E+4n/an/an/an/an/an/a
TBA
Citation and Details
CAM kinase, CDPK family TgCDPK1
(Toxoplasma gondii (strain ATCC 50861 / VEG))
BDBM50250013
(CHEMBL4095218 | US11208411, Compound GXJ261)
Show SMILES Nc1ncnc2n(CC3CCNCC3)nc(Oc3ccc(F)c(Cl)c3)c12
Show InChI InChI=1S/C17H18ClFN6O/c18-12-7-11(1-2-13(12)19)26-17-14-15(20)22-9-23-16(14)25(24-17)8-10-3-5-21-6-4-10/h1-2,7,9-10,21H,3-6,8H2,(H2,20,22,23)
n/an/a 67.5n/an/an/an/an/an/a
TBA
Citation and Details
Calmodulin-domain protein kinase 1 (CDPK1)
(Toxoplasma gondii)
BDBM50250013
(CHEMBL4095218 | US11208411, Compound GXJ261)
Show SMILES Nc1ncnc2n(CC3CCNCC3)nc(Oc3ccc(F)c(Cl)c3)c12
Show InChI InChI=1S/C17H18ClFN6O/c18-12-7-11(1-2-13(12)19)26-17-14-15(20)22-9-23-16(14)25(24-17)8-10-3-5-21-6-4-10/h1-2,7,9-10,21H,3-6,8H2,(H2,20,22,23)
n/an/a 68n/an/an/an/an/an/a
University of California
Curated by ChEMBL
Assay Description
Inhibition of C-terminal His-tagged full length Toxoplasma gondii CDPK1 expressed in Escherichia coli BL21 (DE3) using syntide-2 as substrate pre-inc...
J Med Chem 60: 9976-9989 (2017)
Article DOI: 10.1021/acs.jmedchem.7b01192
BindingDB Entry DOI: 10.7270/Q21G0PP0