null
SMILES: C[C@H](NC(=O)C(C)(F)F)[C@H](Oc1ccc2n(ncc2c1)-c1cccc(c1)C(=O)N1CCC[C@@H]1C(N)=O)c1ccc2COCOc2c1
InChI Key: InChIKey=JTXOLPRFYFONSZ-OFIANZKKSA-N
Activity Spreadsheet -- Enzyme Inhibition Constant Data from BindingDB
Found 2 hits for monomerid = 50250119
Trg + Lig
Ki
nM
ΔG°
kcal/mole
IC50
nM
Kd
nM
EC50/IC50
nM
koff
s-1
kon
M-1s-1
pHTemp
°C
Glucocorticoid receptor
(Homo sapiens (Human))
BDBM50250119
(CHEMBL4098641)
Show SMILES C[C@H](NC(=O)C(C)(F)F)[C@H](Oc1ccc2n(ncc2c1)-c1cccc(c1)C(=O)N1CCC[C@@H]1C(N)=O)c1ccc2COCOc2c1 |r|
Show InChI InChI=1S/C33H33F2N5O6/c1-19(38-32(43)33(2,34)35)29(20-8-9-22-17-44-18-45-28(22)15-20)46-25-10-11-26-23(14-25)16-37-40(26)24-6-3-5-21(13-24)31(42)39-12-4-7-27(39)30(36)41/h3,5-6,8-11,13-16,19,27,29H,4,7,12,17-18H2,1-2H3,(H2,36,41)(H,38,43)/t19-,27+,29-/m0/s1
n/an/a 0.610n/an/an/an/an/an/a
AstraZeneca
Curated by ChEMBL
Assay Description
Transrepression of glucocorticoid receptor in human PBMC assessed as inhibition of LPS induced TNF alpha release preincubated for 45 mins followed by...
J Med Chem 60: 8591-8605 (2017)
Article DOI: 10.1021/acs.jmedchem.7b01215
BindingDB Entry DOI: 10.7270/Q2RX9FH8
Glucocorticoid receptor
(Homo sapiens (Human))
BDBM50250119
(CHEMBL4098641)
Show SMILES C[C@H](NC(=O)C(C)(F)F)[C@H](Oc1ccc2n(ncc2c1)-c1cccc(c1)C(=O)N1CCC[C@@H]1C(N)=O)c1ccc2COCOc2c1 |r|
Show InChI InChI=1S/C33H33F2N5O6/c1-19(38-32(43)33(2,34)35)29(20-8-9-22-17-44-18-45-28(22)15-20)46-25-10-11-26-23(14-25)16-37-40(26)24-6-3-5-21(13-24)31(42)39-12-4-7-27(39)30(36)41/h3,5-6,8-11,13-16,19,27,29H,4,7,12,17-18H2,1-2H3,(H2,36,41)(H,38,43)/t19-,27+,29-/m0/s1
n/an/a 0.150n/an/an/an/an/an/a
AstraZeneca
Curated by ChEMBL
Assay Description
Transrepression of glucocorticoid receptor in human PBMC assessed as inhibition of LPS induced TNF alpha release preincubated for 45 mins followed by...
J Med Chem 60: 8591-8605 (2017)
Article DOI: 10.1021/acs.jmedchem.7b01215
BindingDB Entry DOI: 10.7270/Q2RX9FH8