BDBM50250126 CHEMBL4094154
SMILES: C[C@H](NC(=O)C(C)(F)F)[C@H](Oc1ccc2n(ncc2c1)-c1ccc(F)cc1)c1ccc2COCOc2c1
InChI Key: InChIKey=PHQCNKXMRWOVKR-LMKMVOKYSA-N
Data: 2 IC50
Activity Spreadsheet -- Enzyme Inhibition Constant Data from BindingDB
Found 2 hits for monomerid = 50250126
Trg + Lig
Ki
nM
ΔG°
kcal/mole
IC50
nM
Kd
nM
EC50/IC50
nM
koff
s-1
kon
M-1s-1
pHTemp
°C
Glucocorticoid receptor
(Homo sapiens (Human))
BDBM50250126
(CHEMBL4094154)
Show SMILES C[C@H](NC(=O)C(C)(F)F)[C@H](Oc1ccc2n(ncc2c1)-c1ccc(F)cc1)c1ccc2COCOc2c1 |r|
Show InChI InChI=1S/C27H24F3N3O4/c1-16(32-26(34)27(2,29)30)25(17-3-4-18-14-35-15-36-24(18)12-17)37-22-9-10-23-19(11-22)13-31-33(23)21-7-5-20(28)6-8-21/h3-13,16,25H,14-15H2,1-2H3,(H,32,34)/t16-,25-/m0/s1
n/an/a 0.132n/an/an/an/an/an/a
AstraZeneca
Curated by ChEMBL
Assay Description
Transrepression of glucocorticoid receptor in human PBMC assessed as inhibition of LPS induced TNF alpha release preincubated for 45 mins followed by...
J Med Chem 60: 8591-8605 (2017)
Article DOI: 10.1021/acs.jmedchem.7b01215
BindingDB Entry DOI: 10.7270/Q2RX9FH8
Glucocorticoid receptor
(Homo sapiens (Human))
BDBM50250126
(CHEMBL4094154)
Show SMILES C[C@H](NC(=O)C(C)(F)F)[C@H](Oc1ccc2n(ncc2c1)-c1ccc(F)cc1)c1ccc2COCOc2c1 |r|
Show InChI InChI=1S/C27H24F3N3O4/c1-16(32-26(34)27(2,29)30)25(17-3-4-18-14-35-15-36-24(18)12-17)37-22-9-10-23-19(11-22)13-31-33(23)21-7-5-20(28)6-8-21/h3-13,16,25H,14-15H2,1-2H3,(H,32,34)/t16-,25-/m0/s1
n/an/a 0.0660n/an/an/an/an/an/a
AstraZeneca
Curated by ChEMBL
Assay Description
Transrepression of glucocorticoid receptor in human PBMC assessed as inhibition of LPS induced TNF alpha release preincubated for 45 mins followed by...
J Med Chem 60: 8591-8605 (2017)
Article DOI: 10.1021/acs.jmedchem.7b01215
BindingDB Entry DOI: 10.7270/Q2RX9FH8