BDBM50250271 (+)-codamine::CHEMBL489524::Corydine
SMILES: COc1ccc2C[C@@H]3N(C)CCc4cc(OC)c(O)c(c34)-c2c1OC
InChI Key: InChIKey=IDQUPXZJURZAGF-ZDUSSCGKSA-N
Data: 1 IC50
Activity Spreadsheet -- Enzyme Inhibition Constant Data from BindingDB
Found 1 hit for monomerid = 50250271
Trg + Lig
Ki
nM
ΔG°
kcal/mole
IC50
nM
Kd
nM
EC50/IC50
nM
koff
s-1
kon
M-1s-1
pHTemp
°C
Cyclin-dependent kinase 2
(Homo sapiens (Human))
BDBM50250271
((+)-codamine | CHEMBL489524 | Corydine)
Show SMILES COc1ccc2C[C@@H]3N(C)CCc4cc(OC)c(O)c(c34)-c2c1OC |r|
Show InChI InChI=1S/C20H23NO4/c1-21-8-7-12-10-15(24-3)19(22)18-16(12)13(21)9-11-5-6-14(23-2)20(25-4)17(11)18/h5-6,10,13,22H,7-9H2,1-4H3/t13-/m0/s1
NCI pathway
Reactome pathway
n/an/a>5.00E+4n/an/an/an/an/an/a
Schering Plough Research Institute
Curated by ChEMBL
Assay Description
Inhibition of CDK2
Bioorg Med Chem Lett 20: 1384-7 (2010)
Article DOI: 10.1016/j.bmcl.2010.01.007
BindingDB Entry DOI: 10.7270/Q2QF8TTB