null
SMILES: CO\N=C1\CC[C@@]2(C)[C@@H](CC[C@]3(C)[C@@H]2CC=C2[C@@H]4C[C@@](C)(CC[C@]4(C)CC[C@@]32C)C(O)=O)C1(C)C
InChI Key: InChIKey=SAJCKHUHILYREB-VMJQRFLMSA-N
Activity Spreadsheet -- Enzyme Inhibition Constant Data from BindingDB
Found 1 hit for monomerid = 50250361
Trg + Lig
Ki
nM
ΔG°
kcal/mole
IC50
nM
Kd
nM
EC50/IC50
nM
koff
s-1
kon
M-1s-1
pHTemp
°C
DNA polymerase beta
(Rattus norvegicus)
BDBM50250361
(3-methyloximo-olean-12-en-29-oic acid | CHEMBL5241...)
Show SMILES CO\N=C1\CC[C@@]2(C)[C@@H](CC[C@]3(C)[C@@H]2CC=C2[C@@H]4C[C@@](C)(CC[C@]4(C)CC[C@@]32C)C(O)=O)C1(C)C |r,t:16|
Show InChI InChI=1S/C31H49NO3/c1-26(2)22-11-14-31(7)23(29(22,5)13-12-24(26)32-35-8)10-9-20-21-19-28(4,25(33)34)16-15-27(21,3)17-18-30(20,31)6/h9,21-23H,10-19H2,1-8H3,(H,33,34)/b32-24-/t21-,22-,23+,27+,28+,29-,30+,31+/m0/s1
Reactome pathway
n/an/a 3.60E+4n/an/an/an/an/an/a
University of Virginia Charlottesville
Curated by ChEMBL
Assay Description
Inhibition of rat DNA polymerase beta
J Nat Prod 62: 1110-3 (1999)
Article DOI: 10.1021/np990104r
BindingDB Entry DOI: 10.7270/Q2C8293M