BDBM50250366 CHEMBL4075773
SMILES: CC[C@H]1C[C@H](C[C@@H](CC)N1C(=O)O[C@H]1CC[C@@H](CC1)C(O)=O)N(Cc1cc(cc(c1)C(F)(F)F)C(F)(F)F)c1ncc(cn1)-c1cnn(C)c1
InChI Key: InChIKey=KSPXRTYMEVDHAB-FOQIAJMMSA-N
Data: 1 IC50
Activity Spreadsheet -- Enzyme Inhibition Constant Data from BindingDB
Found 1 hit for monomerid = 50250366
Trg + Lig
Ki
nM
ΔG°
kcal/mole
IC50
nM
Kd
nM
EC50/IC50
nM
koff
s-1
kon
M-1s-1
pHTemp
°C
Cholesteryl ester transfer protein
(Homo sapiens (Human))
BDBM50250366
(CHEMBL4075773)
Show SMILES CC[C@H]1C[C@H](C[C@@H](CC)N1C(=O)O[C@H]1CC[C@@H](CC1)C(O)=O)N(Cc1cc(cc(c1)C(F)(F)F)C(F)(F)F)c1ncc(cn1)-c1cnn(C)c1 |r,wU:4.23,6.6,2.1,13.13,wD:16.20,(37.57,-12.9,;38.91,-13.68,;40.24,-12.9,;40.24,-11.36,;41.57,-10.59,;42.9,-11.36,;42.9,-12.9,;44.24,-13.68,;45.57,-12.9,;41.57,-13.67,;41.57,-15.21,;40.24,-15.97,;42.91,-15.97,;42.91,-17.51,;44.24,-18.28,;44.23,-19.82,;42.89,-20.59,;41.56,-19.82,;41.57,-18.28,;42.89,-22.13,;41.55,-22.9,;44.22,-22.91,;41.57,-9.05,;40.24,-8.27,;40.24,-6.73,;41.58,-5.97,;41.58,-4.43,;40.24,-3.66,;38.9,-4.44,;38.91,-5.98,;37.57,-3.67,;37.56,-2.13,;36.23,-4.45,;36.23,-2.9,;42.91,-3.66,;44.25,-4.44,;42.91,-2.12,;44.24,-2.89,;42.9,-8.28,;44.24,-9.05,;45.57,-8.28,;45.57,-6.74,;44.23,-5.97,;42.9,-6.74,;46.9,-5.97,;48.3,-6.59,;49.34,-5.45,;48.56,-4.11,;49.19,-2.71,;47.05,-4.44,)|
Show InChI InChI=1S/C34H40F6N6O4/c1-4-26-13-28(14-27(5-2)46(26)32(49)50-29-8-6-21(7-9-29)30(47)48)45(31-41-15-22(16-42-31)23-17-43-44(3)19-23)18-20-10-24(33(35,36)37)12-25(11-20)34(38,39)40/h10-12,15-17,19,21,26-29H,4-9,13-14,18H2,1-3H3,(H,47,48)/t21-,26-,27+,28+,29-
Reactome pathway
n/an/a 62n/an/an/an/an/an/a
Novartis Institutes for BioMedical Research, Inc.
Curated by ChEMBL
Assay Description
Inhibition of CETP in human plasma measured every 30 mins for 120 mins by fluorescence method
J Med Chem 60: 8466-8481 (2017)
Article DOI: 10.1021/acs.jmedchem.7b00900
BindingDB Entry DOI: 10.7270/Q27083WQ