BDBM50250671 (4S,8aR,12S,12aR)-12-hydroxy-4-methyl-4,5,6,7,8,8a-hexahydro-1H-benzo[d]oxecine-2,9(12H,12aH)-dione::CHEMBL453428::SCH-642305
SMILES: C[C@H]1CCCC[C@@H]2[C@@H](CC(=O)O1)[C@@H](O)C=CC2=O
InChI Key: InChIKey=WTQWDNIIFGEBSZ-WGBDABJCSA-N
Data: 1 EC50
Activity Spreadsheet -- Enzyme Inhibition Constant Data from BindingDB
Found 1 hit for monomerid = 50250671
Trg + Lig
Ki
nM
ΔG°
kcal/mole
IC50
nM
Kd
nM
EC50/IC50
nM
koff
s-1
kon
M-1s-1
pHTemp
°C
Mobilization protein A
(Escherichia coli)
BDBM50250671
((4S,8aR,12S,12aR)-12-hydroxy-4-methyl-4,5,6,7,8,8a...)
Show SMILES C[C@H]1CCCC[C@@H]2[C@@H](CC(=O)O1)[C@@H](O)C=CC2=O |r,c:15|
Show InChI InChI=1S/C14H20O4/c1-9-4-2-3-5-10-11(8-14(17)18-9)13(16)7-6-12(10)15/h6-7,9-11,13,16H,2-5,8H2,1H3/t9-,10+,11+,13-/m0/s1
n/an/an/an/a 7.00E+4n/an/an/an/a
Schering-Plough Research Institute
Curated by ChEMBL
Assay Description
Inhibition of Escherichia coli DNA primase after 1 hr by [3H]rNTPs incorporation assay
J Nat Prod 66: 1527-30 (2003)
Article DOI: 10.1021/np0302302
BindingDB Entry DOI: 10.7270/Q2765F3G