BDBM50250909 CHEMBL4076254::US10696655, Example 113
SMILES: CNC(=O)N1CCOc2ccc(cc2C1)N1CCCc2cc(-c3cnn(C)c3)c(cc12)C(F)F
InChI Key: InChIKey=TUHCLJSJDWBGHE-UHFFFAOYSA-N
Data: 3 IC50
Activity Spreadsheet -- Enzyme Inhibition Constant Data from BindingDB
Found 3 hits for monomerid = 50250909
Trg + Lig
Ki
nM
ΔG°
kcal/mole
IC50
nM
Kd
nM
EC50/IC50
nM
koff
s-1
kon
M-1s-1
pHTemp
°C
CREB-binding protein
(Homo sapiens (Human))
BDBM50250909
(CHEMBL4076254 | US10696655, Example 113)
Show SMILES CNC(=O)N1CCOc2ccc(cc2C1)N1CCCc2cc(-c3cnn(C)c3)c(cc12)C(F)F
Show InChI InChI=1S/C25H27F2N5O2/c1-28-25(33)31-8-9-34-23-6-5-19(10-17(23)15-31)32-7-3-4-16-11-20(18-13-29-30(2)14-18)21(24(26)27)12-22(16)32/h5-6,10-14,24H,3-4,7-9,15H2,1-2H3,(H,28,33)
Reactome pathway
n/an/a 13n/an/an/an/an/an/a
Genentech
Curated by ChEMBL
Assay Description
Inhibition of His tagged recombinant CBP (unknown origin) by TR-FRET assay
J Med Chem 60: 10151-10171 (2017)
Article DOI: 10.1021/acs.jmedchem.7b01372
BindingDB Entry DOI: 10.7270/Q27S7R65
CREB-binding protein
(Homo sapiens (Human))
BDBM50250909
(CHEMBL4076254 | US10696655, Example 113)
Show SMILES CNC(=O)N1CCOc2ccc(cc2C1)N1CCCc2cc(-c3cnn(C)c3)c(cc12)C(F)F
Show InChI InChI=1S/C25H27F2N5O2/c1-28-25(33)31-8-9-34-23-6-5-19(10-17(23)15-31)32-7-3-4-16-11-20(18-13-29-30(2)14-18)21(24(26)27)12-22(16)32/h5-6,10-14,24H,3-4,7-9,15H2,1-2H3,(H,28,33)
Reactome pathway
US Patent
n/an/a 14n/an/an/an/an/an/a
GENENTECH, INC.; CONSTELLATION PHARMACEUTICALS, INC.
US Patent
Assay Description
His/Flag epitope tagged CBP was cloned, expressed, and purified to homogeneity. CBP binding and inhibition was assessed by monitoring the engagement ...
US Patent US10696655 (2020)
Bromodomain-containing protein 4
(Homo sapiens (Human))
BDBM50250909
(CHEMBL4076254 | US10696655, Example 113)
Show SMILES CNC(=O)N1CCOc2ccc(cc2C1)N1CCCc2cc(-c3cnn(C)c3)c(cc12)C(F)F
Show InChI InChI=1S/C25H27F2N5O2/c1-28-25(33)31-8-9-34-23-6-5-19(10-17(23)15-31)32-7-3-4-16-11-20(18-13-29-30(2)14-18)21(24(26)27)12-22(16)32/h5-6,10-14,24H,3-4,7-9,15H2,1-2H3,(H,28,33)
n/an/a 7.40E+3n/an/an/an/an/an/a
Genentech
Curated by ChEMBL
Assay Description
Inhibition of His tagged recombinant BRD4 bromodomain 1 (unknown origin) by TR-FRET assay
J Med Chem 60: 10151-10171 (2017)
Article DOI: 10.1021/acs.jmedchem.7b01372
BindingDB Entry DOI: 10.7270/Q27S7R65