BDBM50250934 CHEMBL4066906
SMILES: C[C@@H]1NS(=O)(=O)c2ccc(Nc3nn(cc3C(N)=O)[C@H]3COCC[C@@H]3C#N)cc12
InChI Key: InChIKey=BYXNEKGOGSKHAW-RWSFTLGLSA-N
Data: 6 IC50
Activity Spreadsheet -- Enzyme Inhibition Constant Data from BindingDB
Found 6 hits for monomerid = 50250934
Trg + Lig
Ki
nM
ΔG°
kcal/mole
IC50
nM
Kd
nM
EC50/IC50
nM
koff
s-1
kon
M-1s-1
pHTemp
°C
Non-receptor tyrosine-protein kinase TYK2
(Homo sapiens (Human))
BDBM50250934
(CHEMBL4066906)
Show SMILES C[C@@H]1NS(=O)(=O)c2ccc(Nc3nn(cc3C(N)=O)[C@H]3COCC[C@@H]3C#N)cc12 |r|
Show InChI InChI=1S/C18H20N6O4S/c1-10-13-6-12(2-3-16(13)29(26,27)23-10)21-18-14(17(20)25)8-24(22-18)15-9-28-5-4-11(15)7-19/h2-3,6,8,10-11,15,23H,4-5,9H2,1H3,(H2,20,25)(H,21,22)/t10-,11+,15-/m0/s1
n/an/a 1.70n/an/an/an/an/an/a
Merck & Co., Inc.
Curated by ChEMBL
Assay Description
Inhibition of N-terminal GST-tagged recombinant human TYK2 catalytic domain expressed in baculovirus expression system using LCB-EQEDEPEGDYFEWLW-NH2 ...
J Med Chem 60: 9676-9690 (2017)
Article DOI: 10.1021/acs.jmedchem.7b01135
BindingDB Entry DOI: 10.7270/Q20867RD
Tyrosine-protein kinase JAK1
(Homo sapiens (Human))
BDBM50250934
(CHEMBL4066906)
Show SMILES C[C@@H]1NS(=O)(=O)c2ccc(Nc3nn(cc3C(N)=O)[C@H]3COCC[C@@H]3C#N)cc12 |r|
Show InChI InChI=1S/C18H20N6O4S/c1-10-13-6-12(2-3-16(13)29(26,27)23-10)21-18-14(17(20)25)8-24(22-18)15-9-28-5-4-11(15)7-19/h2-3,6,8,10-11,15,23H,4-5,9H2,1H3,(H2,20,25)(H,21,22)/t10-,11+,15-/m0/s1
Reactome pathway
n/an/a 0.0400n/an/an/an/an/an/a
Merck & Co., Inc.
Curated by ChEMBL
Assay Description
Inhibition of GST-tagged recombinant human JAK1 catalytic domain expressed in baculovirus expression system using LCB-EQEDEPEGDYFEWLW-NH2 as substrat...
J Med Chem 60: 9676-9690 (2017)
Article DOI: 10.1021/acs.jmedchem.7b01135
BindingDB Entry DOI: 10.7270/Q20867RD
Tyrosine-protein kinase JAK2
(Homo sapiens (Human))
BDBM50250934
(CHEMBL4066906)
Show SMILES C[C@@H]1NS(=O)(=O)c2ccc(Nc3nn(cc3C(N)=O)[C@H]3COCC[C@@H]3C#N)cc12 |r|
Show InChI InChI=1S/C18H20N6O4S/c1-10-13-6-12(2-3-16(13)29(26,27)23-10)21-18-14(17(20)25)8-24(22-18)15-9-28-5-4-11(15)7-19/h2-3,6,8,10-11,15,23H,4-5,9H2,1H3,(H2,20,25)(H,21,22)/t10-,11+,15-/m0/s1
Reactome pathway
n/an/a 224n/an/an/an/an/an/a
Merck & Co., Inc.
Curated by ChEMBL
Assay Description
Inhibition of JAK2 in EPO-stimulated human TF1 cells expressing stably integrated beta-lactamase reporter gene under control of STAT5 response elemen...
J Med Chem 60: 9676-9690 (2017)
Article DOI: 10.1021/acs.jmedchem.7b01135
BindingDB Entry DOI: 10.7270/Q20867RD
Tyrosine-protein kinase JAK3
(Homo sapiens (Human))
BDBM50250934
(CHEMBL4066906)
Show SMILES C[C@@H]1NS(=O)(=O)c2ccc(Nc3nn(cc3C(N)=O)[C@H]3COCC[C@@H]3C#N)cc12 |r|
Show InChI InChI=1S/C18H20N6O4S/c1-10-13-6-12(2-3-16(13)29(26,27)23-10)21-18-14(17(20)25)8-24(22-18)15-9-28-5-4-11(15)7-19/h2-3,6,8,10-11,15,23H,4-5,9H2,1H3,(H2,20,25)(H,21,22)/t10-,11+,15-/m0/s1
Reactome pathway
n/an/a 315n/an/an/an/an/an/a
Merck & Co., Inc.
Curated by ChEMBL
Assay Description
Inhibition of GST-tagged recombinant human JAK3 catalytic domain expressed in baculovirus expression system using LCB-EQEDEPEGDYFEWLW-NH2 as substrat...
J Med Chem 60: 9676-9690 (2017)
Article DOI: 10.1021/acs.jmedchem.7b01135
BindingDB Entry DOI: 10.7270/Q20867RD
Tyrosine-protein kinase JAK1
(Homo sapiens (Human))
BDBM50250934
(CHEMBL4066906)
Show SMILES C[C@@H]1NS(=O)(=O)c2ccc(Nc3nn(cc3C(N)=O)[C@H]3COCC[C@@H]3C#N)cc12 |r|
Show InChI InChI=1S/C18H20N6O4S/c1-10-13-6-12(2-3-16(13)29(26,27)23-10)21-18-14(17(20)25)8-24(22-18)15-9-28-5-4-11(15)7-19/h2-3,6,8,10-11,15,23H,4-5,9H2,1H3,(H2,20,25)(H,21,22)/t10-,11+,15-/m0/s1
Reactome pathway
n/an/a 16n/an/an/an/an/an/a
Merck & Co., Inc.
Curated by ChEMBL
Assay Description
Inhibition of JAK1 in IL6-stimulated human ME180 cells expressing stably integrated beta-lactamase reporter gene under control of sis-inducible eleme...
J Med Chem 60: 9676-9690 (2017)
Article DOI: 10.1021/acs.jmedchem.7b01135
BindingDB Entry DOI: 10.7270/Q20867RD
Tyrosine-protein kinase JAK2
(Homo sapiens (Human))
BDBM50250934
(CHEMBL4066906)
Show SMILES C[C@@H]1NS(=O)(=O)c2ccc(Nc3nn(cc3C(N)=O)[C@H]3COCC[C@@H]3C#N)cc12 |r|
Show InChI InChI=1S/C18H20N6O4S/c1-10-13-6-12(2-3-16(13)29(26,27)23-10)21-18-14(17(20)25)8-24(22-18)15-9-28-5-4-11(15)7-19/h2-3,6,8,10-11,15,23H,4-5,9H2,1H3,(H2,20,25)(H,21,22)/t10-,11+,15-/m0/s1
Reactome pathway
n/an/a 2n/an/an/an/an/an/a
Merck & Co., Inc.
Curated by ChEMBL
Assay Description
Inhibition of JAK2 in EPO-stimulated human TF1 cells expressing stably integrated beta-lactamase reporter gene under control of STAT5 response elemen...
J Med Chem 60: 9676-9690 (2017)
Article DOI: 10.1021/acs.jmedchem.7b01135
BindingDB Entry DOI: 10.7270/Q20867RD