BDBM50250989 CHEMBL450745::eugeniin
SMILES: Oc1cc(cc(O)c1O)C(=O)O[C@@H]1O[C@@H]2COC(=O)c3cc(O)c(O)c(O)c3-c3c(O)c(O)c(O)cc3C(=O)O[C@H]2[C@H](OC(=O)c2cc(O)c(O)c(O)c2)[C@H]1OC(=O)c1cc(O)c(O)c(O)c1
InChI Key: InChIKey=JCGHAEBIBSEQAD-UUUCSUBKSA-N
Data: 1 KI  2 IC50
Activity Spreadsheet -- Enzyme Inhibition Constant Data from BindingDB
Found 3 hits for monomerid = 50250989
Trg + Lig
Ki
nM
ΔG°
kcal/mole
IC50
nM
Kd
nM
EC50/IC50
nM
koff
s-1
kon
M-1s-1
pHTemp
°C
Beta-secretase 1
(Homo sapiens (Human))
BDBM50250989
(CHEMBL450745 | eugeniin)
Show SMILES Oc1cc(cc(O)c1O)C(=O)O[C@@H]1O[C@@H]2COC(=O)c3cc(O)c(O)c(O)c3-c3c(O)c(O)c(O)cc3C(=O)O[C@H]2[C@H](OC(=O)c2cc(O)c(O)c(O)c2)[C@H]1OC(=O)c1cc(O)c(O)c(O)c1 |r|
Show InChI InChI=1S/C41H30O26/c42-15-1-10(2-16(43)26(15)50)36(57)65-34-33-23(9-62-39(60)13-7-21(48)29(53)31(55)24(13)25-14(40(61)64-33)8-22(49)30(54)32(25)56)63-41(67-38(59)12-5-19(46)28(52)20(47)6-12)35(34)66-37(58)11-3-17(44)27(51)18(45)4-11/h1-8,23,33-35,41-56H,9H2/t23-,33-,34+,35-,41+/m1/s1
6.84E+3n/an/an/an/an/an/an/an/a
Kyungpook National University
Curated by ChEMBL
Assay Description
Inhibition of BACE1 (unknown origin)
Bioorg Med Chem Lett 24: 2945-8 (2014)
Article DOI: 10.1016/j.bmcl.2014.04.060
BindingDB Entry DOI: 10.7270/Q2NV9KSW
Squalene monooxygenase
(Rattus norvegicus)
BDBM50250989
(CHEMBL450745 | eugeniin)
Show SMILES Oc1cc(cc(O)c1O)C(=O)O[C@@H]1O[C@@H]2COC(=O)c3cc(O)c(O)c(O)c3-c3c(O)c(O)c(O)cc3C(=O)O[C@H]2[C@H](OC(=O)c2cc(O)c(O)c(O)c2)[C@H]1OC(=O)c1cc(O)c(O)c(O)c1 |r|
Show InChI InChI=1S/C41H30O26/c42-15-1-10(2-16(43)26(15)50)36(57)65-34-33-23(9-62-39(60)13-7-21(48)29(53)31(55)24(13)25-14(40(61)64-33)8-22(49)30(54)32(25)56)63-41(67-38(59)12-5-19(46)28(52)20(47)6-12)35(34)66-37(58)11-3-17(44)27(51)18(45)4-11/h1-8,23,33-35,41-56H,9H2/t23-,33-,34+,35-,41+/m1/s1
Reactome pathway
n/an/a 1.60E+3n/an/an/an/an/an/a
University of Shizuoka
Curated by ChEMBL
Assay Description
Inhibition of C-terminal hexahistidine-tagged rat recombinant squalene epoxidase without N-terminal putative membrane domain expressed in Escherichia...
J Nat Prod 64: 1010-4 (2001)
BindingDB Entry DOI: 10.7270/Q25Q4X03
Beta-secretase 1
(Homo sapiens (Human))
BDBM50250989
(CHEMBL450745 | eugeniin)
Show SMILES Oc1cc(cc(O)c1O)C(=O)O[C@@H]1O[C@@H]2COC(=O)c3cc(O)c(O)c(O)c3-c3c(O)c(O)c(O)cc3C(=O)O[C@H]2[C@H](OC(=O)c2cc(O)c(O)c(O)c2)[C@H]1OC(=O)c1cc(O)c(O)c(O)c1 |r|
Show InChI InChI=1S/C41H30O26/c42-15-1-10(2-16(43)26(15)50)36(57)65-34-33-23(9-62-39(60)13-7-21(48)29(53)31(55)24(13)25-14(40(61)64-33)8-22(49)30(54)32(25)56)63-41(67-38(59)12-5-19(46)28(52)20(47)6-12)35(34)66-37(58)11-3-17(44)27(51)18(45)4-11/h1-8,23,33-35,41-56H,9H2/t23-,33-,34+,35-,41+/m1/s1
n/an/a 3.10E+3n/an/an/an/an/an/a
Kyungpook National University
Curated by ChEMBL
Assay Description
Inhibition of BACE1 (unknown origin)
Bioorg Med Chem Lett 24: 2945-8 (2014)
Article DOI: 10.1016/j.bmcl.2014.04.060
BindingDB Entry DOI: 10.7270/Q2NV9KSW