BDBM50251103 CHEMBL4084054
SMILES: Cn1cnc(Nc2nc(nc3ccc(Cl)cc23)N2CCC(N)CC2)c1
InChI Key: InChIKey=FFRWUFYTZPMLTK-UHFFFAOYSA-N
Data: 2 KI  1 Kd
PDB links: 1 PDB ID matches this monomer.
Activity Spreadsheet -- Enzyme Inhibition Constant Data from BindingDB
Found 3 hits for monomerid = 50251103
Trg + Lig
Ki
nM
ΔG°
kcal/mole
IC50
nM
Kd
nM
EC50/IC50
nM
koff
s-1
kon
M-1s-1
pHTemp
°C
Serine/threonine-protein kinase PAK 1
(Homo sapiens (Human))
BDBM50251103
(CHEMBL4084054)
Show SMILES Cn1cnc(Nc2nc(nc3ccc(Cl)cc23)N2CCC(N)CC2)c1
Show InChI InChI=1S/C17H20ClN7/c1-24-9-15(20-10-24)22-16-13-8-11(18)2-3-14(13)21-17(23-16)25-6-4-12(19)5-7-25/h2-3,8-10,12H,4-7,19H2,1H3,(H,21,22,23)
>10n/an/an/an/an/an/an/an/a
Shenyang Pharmaceutical University
Curated by ChEMBL
Assay Description
Inhibition of human PAK1 kinase domain using coumarin and fluorescein-labeled ser/thr19 peptide as substrate preincubated for 15 mins followed by ATP...
J Med Chem 61: 265-285 (2018)
Article DOI: 10.1021/acs.jmedchem.7b01342
BindingDB Entry DOI: 10.7270/Q2BK1FSN
Serine/threonine-protein kinase PAK 4
(Homo sapiens (Human))
BDBM50251103
(CHEMBL4084054)
Show SMILES Cn1cnc(Nc2nc(nc3ccc(Cl)cc23)N2CCC(N)CC2)c1
Show InChI InChI=1S/C17H20ClN7/c1-24-9-15(20-10-24)22-16-13-8-11(18)2-3-14(13)21-17(23-16)25-6-4-12(19)5-7-25/h2-3,8-10,12H,4-7,19H2,1H3,(H,21,22,23)
Reactome pathway
710n/an/an/an/an/an/an/an/a
Shenyang Pharmaceutical University
Curated by ChEMBL
Assay Description
Inhibition of human PAK4 kinase domain using coumarin and fluorescein-labeled ser/thr20 peptide as substrate preincubated for 15 mins followed by ATP...
J Med Chem 61: 265-285 (2018)
Article DOI: 10.1021/acs.jmedchem.7b01342
BindingDB Entry DOI: 10.7270/Q2BK1FSN
3D
3D Structure (crystal)
Serine/threonine-protein kinase PAK 4
(Homo sapiens (Human))
BDBM50251103
(CHEMBL4084054)
Show SMILES Cn1cnc(Nc2nc(nc3ccc(Cl)cc23)N2CCC(N)CC2)c1
Show InChI InChI=1S/C17H20ClN7/c1-24-9-15(20-10-24)22-16-13-8-11(18)2-3-14(13)21-17(23-16)25-6-4-12(19)5-7-25/h2-3,8-10,12H,4-7,19H2,1H3,(H,21,22,23)
Reactome pathway
n/an/an/a 156n/an/an/an/an/a
Shenyang Pharmaceutical University
Curated by ChEMBL
Assay Description
Binding affinity to biotin-labeled human truncated PAK4 kinase domain by surface plasmon resonance assay
J Med Chem 61: 265-285 (2018)
Article DOI: 10.1021/acs.jmedchem.7b01342
BindingDB Entry DOI: 10.7270/Q2BK1FSN
3D
3D Structure (crystal)