BDBM50251303 CHEMBL4078189
SMILES: Cc1ccccc1-n1nc(C(=O)Nc2ccc(Oc3ccnc4[nH]ccc34)c(F)c2)c(C)cc1=O
InChI Key: InChIKey=ZAUITWXGIQXSFV-UHFFFAOYSA-N
Data: 1 IC50
Activity Spreadsheet -- Enzyme Inhibition Constant Data from BindingDB
Found 1 hit for monomerid = 50251303
Trg + Lig
Ki
nM
ΔG°
kcal/mole
IC50
nM
Kd
nM
EC50/IC50
nM
koff
s-1
kon
M-1s-1
pHTemp
°C
Hepatocyte growth factor receptor
(Homo sapiens (Human))
BDBM50251303
(CHEMBL4078189)
Show SMILES Cc1ccccc1-n1nc(C(=O)Nc2ccc(Oc3ccnc4[nH]ccc34)c(F)c2)c(C)cc1=O
Show InChI InChI=1S/C26H20FN5O3/c1-15-5-3-4-6-20(15)32-23(33)13-16(2)24(31-32)26(34)30-17-7-8-22(19(27)14-17)35-21-10-12-29-25-18(21)9-11-28-25/h3-14H,1-2H3,(H,28,29)(H,30,34)
n/an/a 10n/an/an/an/an/an/a
School of Pharmacy, Jiangxi Science and Technology Normal University, Nanchang 330013, PR China. Electronic address: tangqidongcn@126.com.
Curated by ChEMBL
Assay Description
Inhibition of c-Met (unknown origin) using poly (Glu, Tyr) 4:1 as substrate after 30 mins by HTRF assay
Eur J Med Chem 133: 97-106 (2017)
Article DOI: 10.1016/j.ejmech.2017.03.045
BindingDB Entry DOI: 10.7270/Q2K35X3B