null
SMILES: CCCOc1cc2CCN(C)[C@@H]3Cc4ccc(O)c(O)c4-c(c1)c23
InChI Key: InChIKey=BCZNYILKVXTJOI-MRXNPFEDSA-N
Activity Spreadsheet -- Enzyme Inhibition Constant Data from BindingDB
Found 3 hits for monomerid = 50251321
Trg + Lig
Ki
nM
ΔG°
kcal/mole
IC50
nM
Kd
nM
EC50/IC50
nM
koff
s-1
kon
M-1s-1
pHTemp
°C
D(2) dopamine receptor
(Rattus norvegicus (rat))
BDBM50251321
((R)-6-Methyl-2-propoxy-5,6,6a,7-tetrahydro-4H-dibe...)
Show SMILES CCCOc1cc2CCN(C)[C@@H]3Cc4ccc(O)c(O)c4-c(c1)c23 |r|
Show InChI InChI=1S/C20H23NO3/c1-3-8-24-14-9-13-6-7-21(2)16-10-12-4-5-17(22)20(23)19(12)15(11-14)18(13)16/h4-5,9,11,16,22-23H,3,6-8,10H2,1-2H3/t16-/m1/s1
Reactome pathway
75n/an/an/an/an/an/an/an/a
University of Debrecen
Curated by ChEMBL
Assay Description
Displacement of [3H]raclopride from rat dopamine D2(short) receptor expressed in CHOK1 cells
Bioorg Med Chem 16: 4563-8 (2008)
Article DOI: 10.1016/j.bmc.2008.02.038
BindingDB Entry DOI: 10.7270/Q24J0DW0
D(1A) dopamine receptor
(Mus musculus (Mouse))
BDBM50251321
((R)-6-Methyl-2-propoxy-5,6,6a,7-tetrahydro-4H-dibe...)
Show SMILES CCCOc1cc2CCN(C)[C@@H]3Cc4ccc(O)c(O)c4-c(c1)c23 |r|
Show InChI InChI=1S/C20H23NO3/c1-3-8-24-14-9-13-6-7-21(2)16-10-12-4-5-17(22)20(23)19(12)15(11-14)18(13)16/h4-5,9,11,16,22-23H,3,6-8,10H2,1-2H3/t16-/m1/s1
3.50E+3n/an/an/an/an/an/an/an/a
University of Debrecen
Curated by ChEMBL
Assay Description
Displacement of [3H]SCH23390 from dopamine D1 receptor in mouse Ltk- fibroblast cells
Bioorg Med Chem 16: 4563-8 (2008)
Article DOI: 10.1016/j.bmc.2008.02.038
BindingDB Entry DOI: 10.7270/Q24J0DW0
D(2) dopamine receptor
(Rattus norvegicus (rat))
BDBM50251321
((R)-6-Methyl-2-propoxy-5,6,6a,7-tetrahydro-4H-dibe...)
Show SMILES CCCOc1cc2CCN(C)[C@@H]3Cc4ccc(O)c(O)c4-c(c1)c23 |r|
Show InChI InChI=1S/C20H23NO3/c1-3-8-24-14-9-13-6-7-21(2)16-10-12-4-5-17(22)20(23)19(12)15(11-14)18(13)16/h4-5,9,11,16,22-23H,3,6-8,10H2,1-2H3/t16-/m1/s1
Reactome pathway
n/an/an/an/a 76n/an/an/an/a
University of Debrecen
Curated by ChEMBL
Assay Description
Agonist activity at rat dopamine D2(short) receptor expressed in CHOK1 cells by [35S]GTPgammaS binding assay
Bioorg Med Chem 16: 4563-8 (2008)
Article DOI: 10.1016/j.bmc.2008.02.038
BindingDB Entry DOI: 10.7270/Q24J0DW0