null
SMILES: CCc1cccc(CC)c1-c1cc(OC)c2C(CCCc2n1)N(C)c1cc(Cl)ccc1C
InChI Key: InChIKey=DBCGZDRTPLJVQO-UHFFFAOYSA-N
Activity Spreadsheet -- Enzyme Inhibition Constant Data from BindingDB
Found 1 hit for monomerid = 50251562
Trg + Lig
Ki
nM
ΔG°
kcal/mole
IC50
nM
Kd
nM
EC50/IC50
nM
koff
s-1
kon
M-1s-1
pHTemp
°C
C5a anaphylatoxin chemotactic receptor 1
(Homo sapiens (Human))
BDBM50251562
((+/-)-N-(5-chloro-2-methylphenyl)-2-(2,6-diethylph...)
Show SMILES CCc1cccc(CC)c1-c1cc(OC)c2C(CCCc2n1)N(C)c1cc(Cl)ccc1C
Show InChI InChI=1S/C28H33ClN2O/c1-6-19-10-8-11-20(7-2)27(19)23-17-26(32-5)28-22(30-23)12-9-13-24(28)31(4)25-16-21(29)15-14-18(25)3/h8,10-11,14-17,24H,6-7,9,12-13H2,1-5H3
n/an/a 2.60E+3n/an/an/an/an/an/a
Johnson & Johnson Pharmaceutical Research and Development
Curated by ChEMBL
Assay Description
Antagonist activity at human recombinant C5a receptor in U937 cells assessed as inhibition of C5a-induced calcium mobilization by FLIPR assay
Bioorg Med Chem Lett 18: 3852-5 (2008)
Article DOI: 10.1016/j.bmcl.2008.06.059
BindingDB Entry DOI: 10.7270/Q2765F4X