BDBM50251658 2-(2-(dimethylamino)propan-2-yl)-1H-benzo[d]imidazole-4-carboxamide::CHEMBL481082
SMILES: CN(C)C(C)(C)c1nc2cccc(C(N)=O)c2[nH]1
InChI Key: InChIKey=VEJUKQSFQCPCBW-UHFFFAOYSA-N
Data: 1 KI  1 EC50
Activity Spreadsheet -- Enzyme Inhibition Constant Data from BindingDB
Found 2 hits for monomerid = 50251658
Trg + Lig
Ki
nM
ΔG°
kcal/mole
IC50
nM
Kd
nM
EC50/IC50
nM
koff
s-1
kon
M-1s-1
pHTemp
°C
Poly [ADP-ribose] polymerase 1
(Homo sapiens (Human))
BDBM50251658
(2-(2-(dimethylamino)propan-2-yl)-1H-benzo[d]imidaz...)
Show SMILES CN(C)C(C)(C)c1nc2cccc(C(N)=O)c2[nH]1
Show InChI InChI=1S/C13H18N4O/c1-13(2,17(3)4)12-15-9-7-5-6-8(11(14)18)10(9)16-12/h5-7H,1-4H3,(H2,14,18)(H,15,16)
9n/an/an/an/an/an/an/an/a
Abbott Laboratories
Curated by ChEMBL
Assay Description
Inhibition of PARP1 (unknown origin)
Bioorg Med Chem Lett 18: 3955-8 (2008)
Article DOI: 10.1016/j.bmcl.2008.06.023
BindingDB Entry DOI: 10.7270/Q24F1QJK
Poly [ADP-ribose] polymerase 1
(Homo sapiens (Human))
BDBM50251658
(2-(2-(dimethylamino)propan-2-yl)-1H-benzo[d]imidaz...)
Show SMILES CN(C)C(C)(C)c1nc2cccc(C(N)=O)c2[nH]1
Show InChI InChI=1S/C13H18N4O/c1-13(2,17(3)4)12-15-9-7-5-6-8(11(14)18)10(9)16-12/h5-7H,1-4H3,(H2,14,18)(H,15,16)
n/an/an/an/a 1.80n/an/an/an/a
Abbott Laboratories
Curated by ChEMBL
Assay Description
Inhibition of PARP1 (unknown origin) in cell based assay
Bioorg Med Chem Lett 18: 3955-8 (2008)
Article DOI: 10.1016/j.bmcl.2008.06.023
BindingDB Entry DOI: 10.7270/Q24F1QJK