BDBM50251920 3-{4-[2-Methylsulfanyl-4-(3-trifluoromethyl-phenyl)-1H-imidazol-5-yl]-pyridin-2-ylamino}-propan-1-ol::CHEMBL519628
SMILES: CSc1nc(c([nH]1)-c1cccc(c1)C(F)(F)F)-c1ccnc(NCCCO)c1
InChI Key: InChIKey=DBHKCDGUVYYIBZ-UHFFFAOYSA-N
Data: 1 IC50
Activity Spreadsheet -- Enzyme Inhibition Constant Data from BindingDB
Found 1 hit for monomerid = 50251920
Trg + Lig
Ki
nM
ΔG°
kcal/mole
IC50
nM
Kd
nM
EC50/IC50
nM
koff
s-1
kon
M-1s-1
pHTemp
°C
Mitogen-activated protein kinase 14
(Homo sapiens (Human))
BDBM50251920
(3-{4-[2-Methylsulfanyl-4-(3-trifluoromethyl-phenyl...)
Show SMILES CSc1nc(c([nH]1)-c1cccc(c1)C(F)(F)F)-c1ccnc(NCCCO)c1
Show InChI InChI=1S/C19H19F3N4OS/c1-28-18-25-16(12-4-2-5-14(10-12)19(20,21)22)17(26-18)13-6-8-24-15(11-13)23-7-3-9-27/h2,4-6,8,10-11,27H,3,7,9H2,1H3,(H,23,24)(H,25,26)
NCI pathway
Reactome pathway
n/an/a 61n/an/an/an/an/an/a
Eberhard-Karls-University Tuebingen
Curated by ChEMBL
Assay Description
Inhibition of p38alpha
J Med Chem 51: 4122-49 (2008)
Article DOI: 10.1021/jm701529q
BindingDB Entry DOI: 10.7270/Q2W37X67