BDBM50252076 (4-(3,5-dimethylphenylamino)-1-methyl-1H-pyrrol-2-yl)(pyrrolidin-1-yl)methanone::CHEMBL444991
SMILES: Cc1cc(C)cc(Nc2cc(C(=O)N3CCCC3)n(C)c2)c1
InChI Key: InChIKey=HFWKXYQIRSHKRX-UHFFFAOYSA-N
Data: 1 KI  1 IC50
Activity Spreadsheet -- Enzyme Inhibition Constant Data from BindingDB
Found 2 hits for monomerid = 50252076
Trg + Lig
Ki
nM
ΔG°
kcal/mole
IC50
nM
Kd
nM
EC50/IC50
nM
koff
s-1
kon
M-1s-1
pHTemp
°C
Androgen Receptor
(Homo sapiens (Human))
BDBM50252076
((4-(3,5-dimethylphenylamino)-1-methyl-1H-pyrrol-2-...)
Show SMILES Cc1cc(C)cc(Nc2cc(C(=O)N3CCCC3)n(C)c2)c1
Show InChI InChI=1S/C18H23N3O/c1-13-8-14(2)10-15(9-13)19-16-11-17(20(3)12-16)18(22)21-6-4-5-7-21/h8-12,19H,4-7H2,1-3H3
NCI pathway
Reactome pathway
3.10E+3n/an/an/an/an/an/an/an/a
The University of Tokyo
Curated by ChEMBL
Assay Description
Displacement of [3H]testosterone from wild type human androgen receptor
Bioorg Med Chem 16: 6799-812 (2008)
Article DOI: 10.1016/j.bmc.2008.05.063
BindingDB Entry DOI: 10.7270/Q2MK6CPV
Androgen Receptor
(Homo sapiens (Human))
BDBM50252076
((4-(3,5-dimethylphenylamino)-1-methyl-1H-pyrrol-2-...)
Show SMILES Cc1cc(C)cc(Nc2cc(C(=O)N3CCCC3)n(C)c2)c1
Show InChI InChI=1S/C18H23N3O/c1-13-8-14(2)10-15(9-13)19-16-11-17(20(3)12-16)18(22)21-6-4-5-7-21/h8-12,19H,4-7H2,1-3H3
NCI pathway
Reactome pathway
n/an/a 1.50E+4n/an/an/an/an/an/a
The University of Tokyo
Curated by ChEMBL
Assay Description
Antagonist activity at wild type human recombinant androgen receptor assessed as inhibition of testosterone-induced growth of mouse androgen dependen...
Bioorg Med Chem 16: 6799-812 (2008)
Article DOI: 10.1016/j.bmc.2008.05.063
BindingDB Entry DOI: 10.7270/Q2MK6CPV