null
SMILES: [O-][N+](=O)c1ccc(cc1)N(Cc1ccccc1)c1cccc(c1)C(=O)N1CCCC1
InChI Key: InChIKey=CLMJUASNOHCNHM-UHFFFAOYSA-N
Activity Spreadsheet -- Enzyme Inhibition Constant Data from BindingDB
Found 2 hits for monomerid = 50252451
Trg + Lig
Ki
nM
ΔG°
kcal/mole
IC50
nM
Kd
nM
EC50/IC50
nM
koff
s-1
kon
M-1s-1
pHTemp
°C
Androgen receptor
(Homo sapiens (Human))
BDBM50252451
(CHEMBL482064 | N-[3-[(Benzyl)(4-nitrophenyl)amino]...)
Show SMILES [O-][N+](=O)c1ccc(cc1)N(Cc1ccccc1)c1cccc(c1)C(=O)N1CCCC1
Show InChI InChI=1S/C24H23N3O3/c28-24(25-15-4-5-16-25)20-9-6-10-23(17-20)26(18-19-7-2-1-3-8-19)21-11-13-22(14-12-21)27(29)30/h1-3,6-14,17H,4-5,15-16,18H2
NCI pathway
Reactome pathway
370n/an/an/an/an/an/an/an/a
The University of Tokyo
Curated by ChEMBL
Assay Description
Displacement of [3H]testosterone from wild type human androgen receptor
Bioorg Med Chem 16: 6799-812 (2008)
Article DOI: 10.1016/j.bmc.2008.05.063
BindingDB Entry DOI: 10.7270/Q2MK6CPV
Androgen receptor
(Homo sapiens (Human))
BDBM50252451
(CHEMBL482064 | N-[3-[(Benzyl)(4-nitrophenyl)amino]...)
Show SMILES [O-][N+](=O)c1ccc(cc1)N(Cc1ccccc1)c1cccc(c1)C(=O)N1CCCC1
Show InChI InChI=1S/C24H23N3O3/c28-24(25-15-4-5-16-25)20-9-6-10-23(17-20)26(18-19-7-2-1-3-8-19)21-11-13-22(14-12-21)27(29)30/h1-3,6-14,17H,4-5,15-16,18H2
NCI pathway
Reactome pathway
n/an/a 4.90E+3n/an/an/an/an/an/a
The University of Tokyo
Curated by ChEMBL
Assay Description
Antagonist activity at wild type human recombinant androgen receptor assessed as inhibition of testosterone-induced growth of mouse androgen dependen...
Bioorg Med Chem 16: 6799-812 (2008)
Article DOI: 10.1016/j.bmc.2008.05.063
BindingDB Entry DOI: 10.7270/Q2MK6CPV