BDBM50252616 CHEMBL494666::{4-[4-(4-Fluoro-phenyl)-2-methylsulfanyl-1H-imidazol-5-yl]-pyridin-2-yl}-(1-phenyl-propyl)-
SMILES: CCC(Nc1cc(ccn1)-c1nc(SC)[nH]c1-c1ccc(F)cc1)c1ccccc1
InChI Key: InChIKey=UDJBRVAZYVZVMH-UHFFFAOYSA-N
Data: 1 IC50
Activity Spreadsheet -- Enzyme Inhibition Constant Data from BindingDB
Found 1 hit for monomerid = 50252616
Trg + Lig
Ki
nM
ΔG°
kcal/mole
IC50
nM
Kd
nM
EC50/IC50
nM
koff
s-1
kon
M-1s-1
pHTemp
°C
Mitogen-activated protein kinase 14
(Homo sapiens (Human))
BDBM50252616
(CHEMBL494666 | {4-[4-(4-Fluoro-phenyl)-2-methylsul...)
Show SMILES CCC(Nc1cc(ccn1)-c1nc(SC)[nH]c1-c1ccc(F)cc1)c1ccccc1
Show InChI InChI=1S/C24H23FN4S/c1-3-20(16-7-5-4-6-8-16)27-21-15-18(13-14-26-21)23-22(28-24(29-23)30-2)17-9-11-19(25)12-10-17/h4-15,20H,3H2,1-2H3,(H,26,27)(H,28,29)
NCI pathway
Reactome pathway
n/an/a 68n/an/an/an/an/an/a
Eberhard-Karls-University Tuebingen
Curated by ChEMBL
Assay Description
Inhibition of p38alpha
J Med Chem 51: 4122-49 (2008)
Article DOI: 10.1021/jm701529q
BindingDB Entry DOI: 10.7270/Q2W37X67