null
SMILES: CSc1nc(c([nH]1)-c1ccc(F)cc1)-c1ccnc(NC2CCc3ccccc23)c1
InChI Key: InChIKey=PBUYEKLDYWMODR-UHFFFAOYSA-N
Activity Spreadsheet -- Enzyme Inhibition Constant Data from BindingDB
Found 1 hit for monomerid = 50252617
Trg + Lig
Ki
nM
ΔG°
kcal/mole
IC50
nM
Kd
nM
EC50/IC50
nM
koff
s-1
kon
M-1s-1
pHTemp
°C
Mitogen-activated protein kinase 14
(Homo sapiens (Human))
BDBM50252617
(CHEMBL494871 | {4-[4-(4-Fluoro-phenyl)-2-methylsul...)
Show SMILES CSc1nc(c([nH]1)-c1ccc(F)cc1)-c1ccnc(NC2CCc3ccccc23)c1
Show InChI InChI=1S/C24H21FN4S/c1-30-24-28-22(16-6-9-18(25)10-7-16)23(29-24)17-12-13-26-21(14-17)27-20-11-8-15-4-2-3-5-19(15)20/h2-7,9-10,12-14,20H,8,11H2,1H3,(H,26,27)(H,28,29)
NCI pathway
Reactome pathway
n/an/a 28n/an/an/an/an/an/a
Eberhard-Karls-University Tuebingen
Curated by ChEMBL
Assay Description
Inhibition of p38alpha
J Med Chem 51: 4122-49 (2008)
Article DOI: 10.1021/jm701529q
BindingDB Entry DOI: 10.7270/Q2W37X67