BDBM50252690 2-(4-(dibenzylamino)phenyl)-1,1,1,3,3,3-hexafluoropropan-2-ol::CHEMBL522039
SMILES: OC(c1ccc(cc1)N(Cc1ccccc1)Cc1ccccc1)(C(F)(F)F)C(F)(F)F
InChI Key: InChIKey=ICESJPMAGXLVST-UHFFFAOYSA-N
Data: 2 IC50
Activity Spreadsheet -- Enzyme Inhibition Constant Data from BindingDB
Found 2 hits for monomerid = 50252690
Trg + Lig
Ki
nM
ΔG°
kcal/mole
IC50
nM
Kd
nM
EC50/IC50
nM
koff
s-1
kon
M-1s-1
pHTemp
°C
Oxysterols receptor LXR-alpha
(Homo sapiens (Human))
BDBM50252690
(2-(4-(dibenzylamino)phenyl)-1,1,1,3,3,3-hexafluoro...)
Show SMILES OC(c1ccc(cc1)N(Cc1ccccc1)Cc1ccccc1)(C(F)(F)F)C(F)(F)F
Show InChI InChI=1S/C23H19F6NO/c24-22(25,26)21(31,23(27,28)29)19-11-13-20(14-12-19)30(15-17-7-3-1-4-8-17)16-18-9-5-2-6-10-18/h1-14,31H,15-16H2
n/an/a 315n/an/an/an/an/an/a
GlaxoSmithKline Research and Development
Curated by ChEMBL
Assay Description
Displacement of [N-methyl-3H]GW0438 from human biotinylated LXRalpha ligand binding domain
J Med Chem 51: 5758-65 (2008)
Article DOI: 10.1021/jm800612u
BindingDB Entry DOI: 10.7270/Q28052FN
Oxysterols receptor LXR-beta
(Homo sapiens (Human))
BDBM50252690
(2-(4-(dibenzylamino)phenyl)-1,1,1,3,3,3-hexafluoro...)
Show SMILES OC(c1ccc(cc1)N(Cc1ccccc1)Cc1ccccc1)(C(F)(F)F)C(F)(F)F
Show InChI InChI=1S/C23H19F6NO/c24-22(25,26)21(31,23(27,28)29)19-11-13-20(14-12-19)30(15-17-7-3-1-4-8-17)16-18-9-5-2-6-10-18/h1-14,31H,15-16H2
n/an/a 175n/an/an/an/an/an/a
GlaxoSmithKline Research and Development
Curated by ChEMBL
Assay Description
Displacement of [N-methyl-3H]GW0438 from human biotinylated LXRbeta ligand binding domain
J Med Chem 51: 5758-65 (2008)
Article DOI: 10.1021/jm800612u
BindingDB Entry DOI: 10.7270/Q28052FN