BDBM50252908 4-[(Butyl{4-[2,2,2-trifluoro-1-hydroxy-1-(trifluoromethyl)ethyl]phenyl}amino)methyl]-2-chlorophenol::CHEMBL492440
SMILES: CCCCN(Cc1ccc(O)c(Cl)c1)c1ccc(cc1)C(O)(C(F)(F)F)C(F)(F)F
InChI Key: InChIKey=WOBTZYHUGUOYFA-UHFFFAOYSA-N
Data: 2 IC50
Activity Spreadsheet -- Enzyme Inhibition Constant Data from BindingDB
Found 2 hits for monomerid = 50252908
Trg + Lig
Ki
nM
ΔG°
kcal/mole
IC50
nM
Kd
nM
EC50/IC50
nM
koff
s-1
kon
M-1s-1
pHTemp
°C
Oxysterols receptor LXR-alpha
(Homo sapiens (Human))
BDBM50252908
(4-[(Butyl{4-[2,2,2-trifluoro-1-hydroxy-1-(trifluor...)
Show SMILES CCCCN(Cc1ccc(O)c(Cl)c1)c1ccc(cc1)C(O)(C(F)(F)F)C(F)(F)F
Show InChI InChI=1S/C20H20ClF6NO2/c1-2-3-10-28(12-13-4-9-17(29)16(21)11-13)15-7-5-14(6-8-15)18(30,19(22,23)24)20(25,26)27/h4-9,11,29-30H,2-3,10,12H2,1H3
n/an/a 560n/an/an/an/an/an/a
GlaxoSmithKline Research and Development
Curated by ChEMBL
Assay Description
Displacement of [N-methyl-3H]GW0438 from human biotinylated LXRalpha ligand binding domain
J Med Chem 51: 5758-65 (2008)
Article DOI: 10.1021/jm800612u
BindingDB Entry DOI: 10.7270/Q28052FN
Oxysterols receptor LXR-beta
(Homo sapiens (Human))
BDBM50252908
(4-[(Butyl{4-[2,2,2-trifluoro-1-hydroxy-1-(trifluor...)
Show SMILES CCCCN(Cc1ccc(O)c(Cl)c1)c1ccc(cc1)C(O)(C(F)(F)F)C(F)(F)F
Show InChI InChI=1S/C20H20ClF6NO2/c1-2-3-10-28(12-13-4-9-17(29)16(21)11-13)15-7-5-14(6-8-15)18(30,19(22,23)24)20(25,26)27/h4-9,11,29-30H,2-3,10,12H2,1H3
n/an/a 50n/an/an/an/an/an/a
GlaxoSmithKline Research and Development
Curated by ChEMBL
Assay Description
Displacement of [N-methyl-3H]GW0438 from human biotinylated LXRbeta ligand binding domain
J Med Chem 51: 5758-65 (2008)
Article DOI: 10.1021/jm800612u
BindingDB Entry DOI: 10.7270/Q28052FN