BDBM50252940 4-[(Butyl{4-[2,2,2-trifluoro-1-hydroxy-1-(trifluoromethyl)ethyl]phenyl}amino)methyl]-2,6-dichlorophenol::CHEMBL493241::GSK-9772
SMILES: CCCCN(Cc1cc(Cl)c(O)c(Cl)c1)c1ccc(cc1)C(O)(C(F)(F)F)C(F)(F)F
InChI Key: InChIKey=TYYLMKBOWXDDCT-UHFFFAOYSA-N
Data: 2 IC50  3 EC50
Activity Spreadsheet -- Enzyme Inhibition Constant Data from BindingDB
Found 5 hits for monomerid = 50252940
Trg + Lig
Ki
nM
ΔG°
kcal/mole
IC50
nM
Kd
nM
EC50/IC50
nM
koff
s-1
kon
M-1s-1
pHTemp
°C
Oxysterols receptor LXR-beta
(Homo sapiens (Human))
BDBM50252940
(4-[(Butyl{4-[2,2,2-trifluoro-1-hydroxy-1-(trifluor...)
Show SMILES CCCCN(Cc1cc(Cl)c(O)c(Cl)c1)c1ccc(cc1)C(O)(C(F)(F)F)C(F)(F)F
Show InChI InChI=1S/C20H19Cl2F6NO2/c1-2-3-8-29(11-12-9-15(21)17(30)16(22)10-12)14-6-4-13(5-7-14)18(31,19(23,24)25)20(26,27)28/h4-7,9-10,30-31H,2-3,8,11H2,1H3
n/an/an/an/a 3.00E+3n/an/an/an/a
GlaxoSmithKline Research and Development
Curated by ChEMBL
Assay Description
Activation of LXRbeta (unknown origin) by GAL4 reporter gene assay
J Med Chem 51: 5758-65 (2008)
Article DOI: 10.1021/jm800612u
BindingDB Entry DOI: 10.7270/Q28052FN
Oxysterols receptor LXR-beta
(Homo sapiens (Human))
BDBM50252940
(4-[(Butyl{4-[2,2,2-trifluoro-1-hydroxy-1-(trifluor...)
Show SMILES CCCCN(Cc1cc(Cl)c(O)c(Cl)c1)c1ccc(cc1)C(O)(C(F)(F)F)C(F)(F)F
Show InChI InChI=1S/C20H19Cl2F6NO2/c1-2-3-8-29(11-12-9-15(21)17(30)16(22)10-12)14-6-4-13(5-7-14)18(31,19(23,24)25)20(26,27)28/h4-7,9-10,30-31H,2-3,8,11H2,1H3
n/an/a 30n/an/an/an/an/an/a
GlaxoSmithKline Research and Development
Curated by ChEMBL
Assay Description
Displacement of [N-methyl-3H]GW0438 from human biotinylated LXRbeta ligand binding domain
J Med Chem 51: 5758-65 (2008)
Article DOI: 10.1021/jm800612u
BindingDB Entry DOI: 10.7270/Q28052FN
Pregnane X receptor
(Homo sapiens (Human))
BDBM50252940
(4-[(Butyl{4-[2,2,2-trifluoro-1-hydroxy-1-(trifluor...)
Show SMILES CCCCN(Cc1cc(Cl)c(O)c(Cl)c1)c1ccc(cc1)C(O)(C(F)(F)F)C(F)(F)F
Show InChI InChI=1S/C20H19Cl2F6NO2/c1-2-3-8-29(11-12-9-15(21)17(30)16(22)10-12)14-6-4-13(5-7-14)18(31,19(23,24)25)20(26,27)28/h4-7,9-10,30-31H,2-3,8,11H2,1H3
n/an/an/an/a 250n/an/an/an/a
GlaxoSmithKline Research and Development
Curated by ChEMBL
Assay Description
Inhibition of human PXR
J Med Chem 51: 5758-65 (2008)
Article DOI: 10.1021/jm800612u
BindingDB Entry DOI: 10.7270/Q28052FN
Oxysterols receptor LXR-alpha
(Homo sapiens (Human))
BDBM50252940
(4-[(Butyl{4-[2,2,2-trifluoro-1-hydroxy-1-(trifluor...)
Show SMILES CCCCN(Cc1cc(Cl)c(O)c(Cl)c1)c1ccc(cc1)C(O)(C(F)(F)F)C(F)(F)F
Show InChI InChI=1S/C20H19Cl2F6NO2/c1-2-3-8-29(11-12-9-15(21)17(30)16(22)10-12)14-6-4-13(5-7-14)18(31,19(23,24)25)20(26,27)28/h4-7,9-10,30-31H,2-3,8,11H2,1H3
n/an/a 180n/an/an/an/an/an/a
GlaxoSmithKline Research and Development
Curated by ChEMBL
Assay Description
Displacement of [N-methyl-3H]GW0438 from human biotinylated LXRalpha ligand binding domain
J Med Chem 51: 5758-65 (2008)
Article DOI: 10.1021/jm800612u
BindingDB Entry DOI: 10.7270/Q28052FN
Oxysterols receptor LXR-alpha
(Homo sapiens (Human))
BDBM50252940
(4-[(Butyl{4-[2,2,2-trifluoro-1-hydroxy-1-(trifluor...)
Show SMILES CCCCN(Cc1cc(Cl)c(O)c(Cl)c1)c1ccc(cc1)C(O)(C(F)(F)F)C(F)(F)F
Show InChI InChI=1S/C20H19Cl2F6NO2/c1-2-3-8-29(11-12-9-15(21)17(30)16(22)10-12)14-6-4-13(5-7-14)18(31,19(23,24)25)20(26,27)28/h4-7,9-10,30-31H,2-3,8,11H2,1H3
n/an/an/an/a 3.00E+3n/an/an/an/a
GlaxoSmithKline Research and Development
Curated by ChEMBL
Assay Description
Activation of LXRalpha (unknown origin) by GAL4 reporter gene assay
J Med Chem 51: 5758-65 (2008)
Article DOI: 10.1021/jm800612u
BindingDB Entry DOI: 10.7270/Q28052FN