BDBM50253028 3alpha,19alpha-dihydroxyurs-12-en-24,28-dioic acid::CHEMBL492457
SMILES: C[C@@H]1CC[C@@]2(CC[C@]3(C)C(=CC[C@@H]4[C@@]5(C)CC[C@@H](O)[C@@](C)([C@@H]5CC[C@@]34C)C(O)=O)[C@@H]2[C@]1(C)O)C(O)=O
InChI Key: InChIKey=UIEGOKVPCRANSU-NASGHRROSA-N
Data: 1 IC50
Activity Spreadsheet -- Enzyme Inhibition Constant Data from BindingDB
Found 1 hit for monomerid = 50253028
Trg + Lig
Ki
nM
ΔG°
kcal/mole
IC50
nM
Kd
nM
EC50/IC50
nM
koff
s-1
kon
M-1s-1
pHTemp
°C
Protein-tyrosine phosphatase 1B
(Homo sapiens (Human))
BDBM50253028
(3alpha,19alpha-dihydroxyurs-12-en-24,28-dioic acid...)
Show SMILES C[C@@H]1CC[C@@]2(CC[C@]3(C)C(=CC[C@@H]4[C@@]5(C)CC[C@@H](O)[C@@](C)([C@@H]5CC[C@@]34C)C(O)=O)[C@@H]2[C@]1(C)O)C(O)=O |r,c:9|
Show InChI InChI=1S/C30H46O6/c1-17-9-14-30(24(34)35)16-15-26(3)18(22(30)29(17,6)36)7-8-19-25(2)12-11-21(31)28(5,23(32)33)20(25)10-13-27(19,26)4/h7,17,19-22,31,36H,8-16H2,1-6H3,(H,32,33)(H,34,35)/t17-,19-,20-,21-,22-,25-,26-,27-,28-,29-,30+/m1/s1
NCI pathway
Reactome pathway
n/an/a>3.00E+4n/an/an/an/an/an/a
Chosun University
Curated by ChEMBL
Assay Description
Inhibition of human recombinant PTP1B after 30 mins
J Nat Prod 71: 1775-8 (2008)
Article DOI: 10.1021/np800298w
BindingDB Entry DOI: 10.7270/Q2TQ62F7