BDBM50253029 CHEMBL492458::coussaric acid
SMILES: C[C@]1(O)[C@H]2C3=CC[C@@H]4[C@@]5(C)CC[C@@H](O)[C@](C)(CO)[C@@H]5CC[C@@]4(C)[C@]3(C)CC[C@]2(CCC1=C)C(O)=O
InChI Key: InChIKey=GNUFXZJKHUYVFB-HIABBIIJSA-N
Data: 1 IC50
Activity Spreadsheet -- Enzyme Inhibition Constant Data from BindingDB
Found 1 hit for monomerid = 50253029
Trg + Lig
Ki
nM
ΔG°
kcal/mole
IC50
nM
Kd
nM
EC50/IC50
nM
koff
s-1
kon
M-1s-1
pHTemp
°C
Protein-tyrosine phosphatase 1B
(Homo sapiens (Human))
BDBM50253029
(CHEMBL492458 | coussaric acid)
Show SMILES C[C@]1(O)[C@H]2C3=CC[C@@H]4[C@@]5(C)CC[C@@H](O)[C@](C)(CO)[C@@H]5CC[C@@]4(C)[C@]3(C)CC[C@]2(CCC1=C)C(O)=O |r,t:4|
Show InChI InChI=1S/C30H46O5/c1-18-9-14-30(24(33)34)16-15-27(4)19(23(30)29(18,6)35)7-8-21-25(2)12-11-22(32)26(3,17-31)20(25)10-13-28(21,27)5/h7,20-23,31-32,35H,1,8-17H2,2-6H3,(H,33,34)/t20-,21-,22-,23-,25+,26-,27-,28-,29-,30+/m1/s1
NCI pathway
Reactome pathway
n/an/a>3.00E+4n/an/an/an/an/an/a
Chosun University
Curated by ChEMBL
Assay Description
Inhibition of human recombinant PTP1B after 30 mins
J Nat Prod 71: 1775-8 (2008)
Article DOI: 10.1021/np800298w
BindingDB Entry DOI: 10.7270/Q2TQ62F7